Uploaded image for project: 'Qt Automotive Suite'
  1. Qt Automotive Suite
  2. AUTOSUITE-1308

Neptune3-ui build is broken in our boot2qt image (due to enabled examples build).

    XMLWordPrintable

    Details

    • Type: Bug
    • Status: Closed
    • Priority: P1: Critical
    • Resolution: Fixed
    • Affects Version/s: 5.13.1
    • Fix Version/s: 5.13.2
    • Component/s: Device Images, Neptune3
    • Labels:
      None
    • Platform/s:
      Linux/Wayland
    • Commits:
      9a5900994961569e780c097a368dc9476e0a0550,b18f3481bc4475015ac89deddc0e36088a930fbe,0954ff84cae84e24f31fd165dbc3e2c4163eae4b

      Description

      After enabling examples build in neptune3-ui.pro (without and option to disable it),
      neptune3-ui build in our boot2qt image is broken, because examples require appman-packager, which is not in the dependencies.

      The same will happen with official boot2qt image, when SHA will be updated.

      So - should the examples be built by default? Or at least, the option to not build them should be implemented.

      [03:34:49]| make[1]: Entering directory '/home/teamcity/TeamCity/buildAgent/work/e56e53f054eab947/build-intel-corei7-64/build-intel-corei7-64/tmp/work/intel_corei7_64-poky-linux/neptune3-ui/5.13.2+gitAUTOINC+d79d612b18-r0/build/examples'
      [03:34:49]| cd neptune3ui/ && ( test -e Makefile || /home/teamcity/TeamCity/buildAgent/work/e56e53f054eab947/build-intel-corei7-64/build-intel-corei7-64/tmp/work/intel_corei7_64-poky-linux/neptune3-ui/5.13.2+gitAUTOINC+d79d612b18-r0/recipe-sysroot-native/usr/bin/qmake -o Makefile /home/teamcity/TeamCity/buildAgent/work/e56e53f054eab947/build-intel-corei7-64/build-intel-corei7-64/tmp/work/intel_corei7_64-poky-linux/neptune3-ui/5.13.2+gitAUTOINC+d79d612b18-r0/git/examples/neptune3ui/neptune3ui.pro CONFIG+=use_qsr ) && make -f Makefile
      [03:34:49]| make[2]: Entering directory '/home/teamcity/TeamCity/buildAgent/work/e56e53f054eab947/build-intel-corei7-64/build-intel-corei7-64/tmp/work/intel_corei7_64-poky-linux/neptune3-ui/5.13.2+gitAUTOINC+d79d612b18-r0/build/examples/neptune3ui'
      [03:34:49]| cd parking-app-tutorial/ && ( test -e Makefile || /home/teamcity/TeamCity/buildAgent/work/e56e53f054eab947/build-intel-corei7-64/build-intel-corei7-64/tmp/work/intel_corei7_64-poky-linux/neptune3-ui/5.13.2+gitAUTOINC+d79d612b18-r0/recipe-sysroot-native/usr/bin/qmake -o Makefile /home/teamcity/TeamCity/buildAgent/work/e56e53f054eab947/build-intel-corei7-64/build-intel-corei7-64/tmp/work/intel_corei7_64-poky-linux/neptune3-ui/5.13.2+gitAUTOINC+d79d612b18-r0/git/examples/neptune3ui/parking-app-tutorial/parking-app-tutorial.pro CONFIG+=use_qsr ) && make -f Makefile
      [03:34:49]| make[3]: Entering directory '/home/teamcity/TeamCity/buildAgent/work/e56e53f054eab947/build-intel-corei7-64/build-intel-corei7-64/tmp/work/intel_corei7_64-poky-linux/neptune3-ui/5.13.2+gitAUTOINC+d79d612b18-r0/build/examples/neptune3ui/parking-app-tutorial'
      [03:34:49]| cp -f -R /home/teamcity/TeamCity/buildAgent/work/e56e53f054eab947/build-intel-corei7-64/build-intel-corei7-64/tmp/work/intel_corei7_64-poky-linux/neptune3-ui/5.13.2+gitAUTOINC+d79d612b18-r0/git/dev/apps /home/teamcity/TeamCity/buildAgent/work/e56e53f054eab947/build-intel-corei7-64/build-intel-corei7-64/tmp/work/intel_corei7_64-poky-linux/neptune3-ui/5.13.2+gitAUTOINC+d79d612b18-r0/build
      [03:34:49]| cd chapter1-basics/ && ( test -e Makefile || /home/teamcity/TeamCity/buildAgent/work/e56e53f054eab947/build-intel-corei7-64/build-intel-corei7-64/tmp/work/intel_corei7_64-poky-linux/neptune3-ui/5.13.2+gitAUTOINC+d79d612b18-r0/recipe-sysroot-native/usr/bin/qmake -o Makefile /home/teamcity/TeamCity/buildAgent/work/e56e53f054eab947/build-intel-corei7-64/build-intel-corei7-64/tmp/work/intel_corei7_64-poky-linux/neptune3-ui/5.13.2+gitAUTOINC+d79d612b18-r0/git/examples/neptune3ui/parking-app-tutorial/chapter1-basics/chapter1-basics.pro CONFIG+=use_qsr ) && make -f Makefile
      [03:34:49]| cd chapter2-extend/ && ( test -e Makefile || /home/teamcity/TeamCity/buildAgent/work/e56e53f054eab947/build-intel-corei7-64/build-intel-corei7-64/tmp/work/intel_corei7_64-poky-linux/neptune3-ui/5.13.2+gitAUTOINC+d79d612b18-r0/recipe-sysroot-native/usr/bin/qmake -o Makefile /home/teamcity/TeamCity/buildAgent/work/e56e53f054eab947/build-intel-corei7-64/build-intel-corei7-64/tmp/work/intel_corei7_64-poky-linux/neptune3-ui/5.13.2+gitAUTOINC+d79d612b18-r0/git/examples/neptune3ui/parking-app-tutorial/chapter2-extend/chapter2-extend.pro CONFIG+=use_qsr ) && make -f Makefile
      [03:34:49]| cd chapter3-middleware/ && ( test -e Makefile || /home/teamcity/TeamCity/buildAgent/work/e56e53f054eab947/build-intel-corei7-64/build-intel-corei7-64/tmp/work/intel_corei7_64-poky-linux/neptune3-ui/5.13.2+gitAUTOINC+d79d612b18-r0/recipe-sysroot-native/usr/bin/qmake -o Makefile /home/teamcity/TeamCity/buildAgent/work/e56e53f054eab947/build-intel-corei7-64/build-intel-corei7-64/tmp/work/intel_corei7_64-poky-linux/neptune3-ui/5.13.2+gitAUTOINC+d79d612b18-r0/git/examples/neptune3ui/parking-app-tutorial/chapter3-middleware/chapter3-middleware.pro CONFIG+=use_qsr ) && make -f Makefile
      [03:34:49]| cp -f -R /home/teamcity/TeamCity/buildAgent/work/e56e53f054eab947/build-intel-corei7-64/build-intel-corei7-64/tmp/work/intel_corei7_64-poky-linux/neptune3-ui/5.13.2+gitAUTOINC+d79d612b18-r0/git/imports_shared /home/teamcity/TeamCity/buildAgent/work/e56e53f054eab947/build-intel-corei7-64/build-intel-corei7-64/tmp/work/intel_corei7_64-poky-linux/neptune3-ui/5.13.2+gitAUTOINC+d79d612b18-r0/build
      [03:34:49]| cp -f -R /home/teamcity/TeamCity/buildAgent/work/e56e53f054eab947/build-intel-corei7-64/build-intel-corei7-64/tmp/work/intel_corei7_64-poky-linux/neptune3-ui/5.13.2+gitAUTOINC+d79d612b18-r0/git/imports_system /home/teamcity/TeamCity/buildAgent/work/e56e53f054eab947/build-intel-corei7-64/build-intel-corei7-64/tmp/work/intel_corei7_64-poky-linux/neptune3-ui/5.13.2+gitAUTOINC+d79d612b18-r0/build
      [03:34:49]| sh: 1: /home/teamcity/TeamCity/buildAgent/work/e56e53f054eab947/build-intel-corei7-64/build-intel-corei7-64/tmp/work/intel_corei7_64-poky-linux/neptune3-ui/5.13.2+gitAUTOINC+d79d612b18-r0/recipe-sysroot-native/usr/bin/appman-packager: not found
      [03:34:49]| sh: 1: /home/teamcity/TeamCity/buildAgent/work/e56e53f054eab947/build-intel-corei7-64/build-intel-corei7-64/tmp/work/intel_corei7_64-poky-linux/neptune3-ui/5.13.2+gitAUTOINC+d79d612b18-r0/recipe-sysroot-native/usr/bin/appman-packager: not found
      [03:34:49]| sh: 1: /home/teamcity/TeamCity/buildAgent/work/e56e53f054eab947/build-intel-corei7-64/build-intel-corei7-64/tmp/work/intel_corei7_64-poky-linux/neptune3-ui/5.13.2+gitAUTOINC+d79d612b18-r0/recipe-sysroot-native/usr/bin/appman-packager: not found
      [03:34:49]| /home/teamcity/TeamCity/buildAgent/work/e56e53f054eab947/build-intel-corei7-64/build-intel-corei7-64/tmp/work/intel_corei7_64-poky-linux/neptune3-ui/5.13.2+gitAUTOINC+d79d612b18-r0/recipe-sysroot/usr/lib/mkspecs/features/am-app.prf:16: Error parsing JSON at 1:1: illegal value
      [03:34:49]| Project ERROR: Failed to parse appman-packager output.
      [03:34:49]| /home/teamcity/TeamCity/buildAgent/work/e56e53f054eab947/build-intel-corei7-64/build-intel-corei7-64/tmp/work/intel_corei7_64-poky-linux/neptune3-ui/5.13.2+gitAUTOINC+d79d612b18-r0/recipe-sysroot/usr/lib/mkspecs/features/am-app.prf:16: Error parsing JSON at 1:1: illegal value
      [03:34:49]| /home/teamcity/TeamCity/buildAgent/work/e56e53f054eab947/build-intel-corei7-64/build-intel-corei7-64/tmp/work/intel_corei7_64-poky-linux/neptune3-ui/5.13.2+gitAUTOINC+d79d612b18-r0/recipe-sysroot/usr/lib/mkspecs/features/am-app.prf:16: Error parsing JSON at 1:1: illegal value
      [03:34:49]| Project ERROR: Failed to parse appman-packager output.
      [03:34:49]| Project ERROR: Failed to parse appman-packager output.
      [03:34:49]| cp -f -R /home/teamcity/TeamCity/buildAgent/work/e56e53f054eab947/build-intel-corei7-64/build-intel-corei7-64/tmp/work/intel_corei7_64-poky-linux/neptune3-ui/5.13.2+gitAUTOINC+d79d612b18-r0/git/sysui /home/teamcity/TeamCity/buildAgent/work/e56e53f054eab947/build-intel-corei7-64/build-intel-corei7-64/tmp/work/intel_corei7_64-poky-linux/neptune3-ui/5.13.2+gitAUTOINC+d79d612b18-r0/build
      [03:34:49]| Makefile:73: recipe for target 'sub-chapter2-extend-make_first' failed
      [03:34:49]| make[3]: *** [sub-chapter2-extend-make_first] Error 3
      [03:34:49]| make[3]: *** Waiting for unfinished jobs....
      [03:34:49]| Makefile:48: recipe for target 'sub-chapter1-basics-make_first' failed
      [03:34:49]| make[3]: *** [sub-chapter1-basics-make_first] Error 3
      [03:34:49]| Makefile:98: recipe for target 'sub-chapter3-middleware-make_first' failed
      [03:34:49]| make[3]: *** [sub-chapter3-middleware-make_first] Error 3
      [03:34:49]| make[3]: Leaving directory '/home/teamcity/TeamCity/buildAgent/work/e56e53f054eab947/build-intel-corei7-64/build-intel-corei7-64/tmp/work/intel_corei7_64-poky-linux/neptune3-ui/5.13.2+gitAUTOINC+d79d612b18-r0/build/examples/neptune3ui/parking-app-tutorial'
      [03:34:49]| Makefile:46: recipe for target 'sub-parking-app-tutorial-make_first' failed
      [03:34:49]| make[2]: *** [sub-parking-app-tutorial-make_first] Error 2
      [03:34:49]| make[2]: Leaving directory '/home/teamcity/TeamCity/buildAgent/work/e56e53f054eab947/build-intel-corei7-64/build-intel-corei7-64/tmp/work/intel_corei7_64-poky-linux/neptune3-ui/5.13.2+gitAUTOINC+d79d612b18-r0/build/examples/neptune3ui'
      [03:34:49]| Makefile:46: recipe for target 'sub-neptune3ui-make_first' failed
      [03:34:49]| make[1]: *** [sub-neptune3ui-make_first] Error 2
      [03:34:49]| make[1]: Leaving directory '/home/teamcity/TeamCity/buildAgent/work/e56e53f054eab947/build-intel-corei7-64/build-intel-corei7-64/tmp/work/intel_corei7_64-poky-linux/neptune3-ui/5.13.2+gitAUTOINC+d79d612b18-r0/build/examples'
      [03:34:49]| Makefile:126: recipe for target 'sub-examples-make_first' failed
      [03:34:49]| make: *** [sub-examples-make_first] Error 2
      [03:34:49]| make: *** Waiting for unfinished jobs....

        Attachments

        For Gerrit Dashboard: AUTOSUITE-1308
        # Subject Branch Project Status CR V

          Activity

            People

            Assignee:
            gagi Dominik Holland
            Reporter:
            n.z. Nikolay Zamotaev
            Votes:
            0 Vote for this issue
            Watchers:
            4 Start watching this issue

              Dates

              Created:
              Updated:
              Resolved:

                Gerrit Reviews

                There are no open Gerrit changes