Uploaded image for project: 'Qt Automotive Suite'
  1. Qt Automotive Suite
  2. AUTOSUITE-1467

QtAS 5.13.2 Boot2Qt fails

    XMLWordPrintable

    Details

    • Type: Bug
    • Status: Closed
    • Priority: P0: Blocker
    • Resolution: Done
    • Affects Version/s: 5.13.2
    • Fix Version/s: 5.13.2
    • Component/s: Device Images
    • Labels:
      None

      Description

      agent:2020/02/10 13:29:55 build.go:220: NOTE: recipe imx-alsa-plugins-1.0.26-r0: task do_compile: Started
      agent:2020/02/10 13:29:56 build.go:220: ERROR: imx-alsa-plugins-1.0.26-r0 do_compile: oe_runmake failed
      agent:2020/02/10 13:29:56 build.go:220: ERROR: imx-alsa-plugins-1.0.26-r0 do_compile: Function failed: do_compile (log file is located at /home/qt/work/build/build-nitrogen6x/tmp/work/cortexa9t2hf-neon-mx6qdl-poky-linux-gnueabi/imx-alsa-plugins/1.0.26-r0/temp/log.do_compile.17846)
      agent:2020/02/10 13:29:56 build.go:220: ERROR: Logfile of failure stored in: /home/qt/work/build/build-nitrogen6x/tmp/work/cortexa9t2hf-neon-mx6qdl-poky-linux-gnueabi/imx-alsa-plugins/1.0.26-r0/temp/log.do_compile.17846
      agent:2020/02/10 13:29:56 build.go:220: Log data follows:
      agent:2020/02/10 13:29:56 build.go:220: | DEBUG: SITE files ['endian-little', 'bit-32', 'arm-common', 'arm-32', 'common-linux', 'common-glibc', 'arm-linux', 'arm-linux-gnueabi', 'common']
      agent:2020/02/10 13:29:56 build.go:220: | DEBUG: Executing shell function do_compile
      agent:2020/02/10 13:29:56 build.go:220: | NOTE: make -j 8
      agent:2020/02/10 13:29:56 build.go:220: | make all-recursive
      agent:2020/02/10 13:29:56 build.go:220: | make[1]: Entering directory '/home/qt/work/build/build-nitrogen6x/tmp/work/cortexa9t2hf-neon-mx6qdl-poky-linux-gnueabi/imx-alsa-plugins/1.0.26-r0/build'
      agent:2020/02/10 13:29:56 build.go:220: | Making all in asrc
      agent:2020/02/10 13:29:56 build.go:220: | make[2]: Entering directory '/home/qt/work/build/build-nitrogen6x/tmp/work/cortexa9t2hf-neon-mx6qdl-poky-linux-gnueabi/imx-alsa-plugins/1.0.26-r0/build/asrc'
      agent:2020/02/10 13:29:56 build.go:220: | ../arm-poky-linux-gnueabi-libtool --tag=CC --mode=compile arm-poky-linux-gnueabi-gcc -march=armv7-a -mthumb -mfpu=neon -mfloat-abi=hard -mcpu=cortex-a9 -fstack-protector-strong -D_FORTIFY_SOURCE=2 -Wformat -Wformat-security -Werror=format-security --sysroot=/home/qt/work/build/build-nitrogen6x/tmp/work/cortexa9t2hf-neon-mx6qdl-poky-linux-gnueabi/imx-alsa-plugins/1.0.26-r0/recipe-sysroot -DHAVE_CONFIG_H -I. -I../../git/asrc -I.. -Wall -g -I/home/qt/work/build/build-nitrogen6x/tmp/work/cortexa9t2hf-neon-mx6qdl-poky-linux-gnueabi/imx-alsa-plugins/1.0.26-r0/recipe-sysroot/usr/include/alsa -I/home/qt/work/build/build-nitrogen6x/tmp/work/cortexa9t2hf-neon-mx6qdl-poky-linux-gnueabi/imx-alsa-plugins/1.0.26-r0/recipe-sysroot/usr/include/imx -c -o rate_asrcrate.lo ../../git/asrc/rate_asrcrate.c
      agent:2020/02/10 13:29:56 build.go:220: | ../arm-poky-linux-gnueabi-libtool --tag=CC --mode=compile arm-poky-linux-gnueabi-gcc -march=armv7-a -mthumb -mfpu=neon -mfloat-abi=hard -mcpu=cortex-a9 -fstack-protector-strong -D_FORTIFY_SOURCE=2 -Wformat -Wformat-security -Werror=format-security --sysroot=/home/qt/work/build/build-nitrogen6x/tmp/work/cortexa9t2hf-neon-mx6qdl-poky-linux-gnueabi/imx-alsa-plugins/1.0.26-r0/recipe-sysroot -DHAVE_CONFIG_H -I. -I../../git/asrc -I.. -Wall -g -I/home/qt/work/build/build-nitrogen6x/tmp/work/cortexa9t2hf-neon-mx6qdl-poky-linux-gnueabi/imx-alsa-plugins/1.0.26-r0/recipe-sysroot/usr/include/alsa -I/home/qt/work/build/build-nitrogen6x/tmp/work/cortexa9t2hf-neon-mx6qdl-poky-linux-gnueabi/imx-alsa-plugins/1.0.26-r0/recipe-sysroot/usr/include/imx -c -o asrc_pair.lo ../../git/asrc/asrc_pair.c
      agent:2020/02/10 13:29:56 build.go:220: | arm-poky-linux-gnueabi-libtool: compile: arm-poky-linux-gnueabi-gcc -march=armv7-a -mthumb -mfpu=neon -mfloat-abi=hard -mcpu=cortex-a9 -fstack-protector-strong -D_FORTIFY_SOURCE=2 -Wformat -Wformat-security -Werror=format-security --sysroot=/home/qt/work/build/build-nitrogen6x/tmp/work/cortexa9t2hf-neon-mx6qdl-poky-linux-gnueabi/imx-alsa-plugins/1.0.26-r0/recipe-sysroot -DHAVE_CONFIG_H -I. -I../../git/asrc -I.. -Wall -g -I/home/qt/work/build/build-nitrogen6x/tmp/work/cortexa9t2hf-neon-mx6qdl-poky-linux-gnueabi/imx-alsa-plugins/1.0.26-r0/recipe-sysroot/usr/include/alsa -I/home/qt/work/build/build-nitrogen6x/tmp/work/cortexa9t2hf-neon-mx6qdl-poky-linux-gnueabi/imx-alsa-plugins/1.0.26-r0/recipe-sysroot/usr/include/imx -c ../../git/asrc/rate_asrcrate.c -fPIC -DPIC -o .libs/rate_asrcrate.o
      agent:2020/02/10 13:29:56 build.go:220: | arm-poky-linux-gnueabi-libtool: compile: arm-poky-linux-gnueabi-gcc -march=armv7-a -mthumb -mfpu=neon -mfloat-abi=hard -mcpu=cortex-a9 -fstack-protector-strong -D_FORTIFY_SOURCE=2 -Wformat -Wformat-security -Werror=format-security --sysroot=/home/qt/work/build/build-nitrogen6x/tmp/work/cortexa9t2hf-neon-mx6qdl-poky-linux-gnueabi/imx-alsa-plugins/1.0.26-r0/recipe-sysroot -DHAVE_CONFIG_H -I. -I../../git/asrc -I.. -Wall -g -I/home/qt/work/build/build-nitrogen6x/tmp/work/cortexa9t2hf-neon-mx6qdl-poky-linux-gnueabi/imx-alsa-plugins/1.0.26-r0/recipe-sysroot/usr/include/alsa -I/home/qt/work/build/build-nitrogen6x/tmp/work/cortexa9t2hf-neon-mx6qdl-poky-linux-gnueabi/imx-alsa-plugins/1.0.26-r0/recipe-sysroot/usr/include/imx -c ../../git/asrc/asrc_pair.c -fPIC -DPIC -o .libs/asrc_pair.o
      agent:2020/02/10 13:29:56 build.go:220: | In file included from /home/qt/work/build/build-nitrogen6x/tmp/work/cortexa9t2hf-neon-mx6qdl-poky-linux-gnueabi/imx-alsa-plugins/1.0.26-r0/recipe-sysroot/usr/include/bits/libc-header-start.h:33,
      agent:2020/02/10 13:29:56 build.go:220: | from /home/qt/work/build/build-nitrogen6x/tmp/work/cortexa9t2hf-neon-mx6qdl-poky-linux-gnueabi/imx-alsa-plugins/1.0.26-r0/recipe-sysroot/usr/include/stdio.h:27,
      agent:2020/02/10 13:29:56 build.go:220: | from ../../git/asrc/asrc_pair.c:19:
      agent:2020/02/10 13:29:56 build.go:220: | /home/qt/work/build/build-nitrogen6x/tmp/work/cortexa9t2hf-neon-mx6qdl-poky-linux-gnueabi/imx-alsa-plugins/1.0.26-r0/recipe-sysroot/usr/include/features.h:381:4: warning: #warning _FORTIFY_SOURCE requires compiling with optimization (-O) [-Wcpp]
      agent:2020/02/10 13:29:56 build.go:220: | # warning _FORTIFY_SOURCE requires compiling with optimization (-O)
      agent:2020/02/10 13:29:56 build.go:220: | ^~~~~~~
      agent:2020/02/10 13:29:56 build.go:220: | In file included from /home/qt/work/build/build-nitrogen6x/tmp/work/cortexa9t2hf-neon-mx6qdl-poky-linux-gnueabi/imx-alsa-plugins/1.0.26-r0/recipe-sysroot/usr/include/bits/libc-header-start.h:33,
      agent:2020/02/10 13:29:56 build.go:220: | from /home/qt/work/build/build-nitrogen6x/tmp/work/cortexa9t2hf-neon-mx6qdl-poky-linux-gnueabi/imx-alsa-plugins/1.0.26-r0/recipe-sysroot/usr/include/stdio.h:27,
      agent:2020/02/10 13:29:56 build.go:220: | from ../../git/asrc/rate_asrcrate.c:19:
      agent:2020/02/10 13:29:56 build.go:220: | /home/qt/work/build/build-nitrogen6x/tmp/work/cortexa9t2hf-neon-mx6qdl-poky-linux-gnueabi/imx-alsa-plugins/1.0.26-r0/recipe-sysroot/usr/include/features.h:381:4: warning: #warning _FORTIFY_SOURCE requires compiling with optimization (-O) [-Wcpp]
      agent:2020/02/10 13:29:56 build.go:220: | # warning _FORTIFY_SOURCE requires compiling with optimization (-O)
      agent:2020/02/10 13:29:56 build.go:220: | ^~~~~~~
      agent:2020/02/10 13:29:56 build.go:220: | In file included from ../../git/asrc/asrc_pair.c:28:
      agent:2020/02/10 13:29:56 build.go:220: | /home/qt/work/build/build-nitrogen6x/tmp/work/cortexa9t2hf-neon-mx6qdl-poky-linux-gnueabi/imx-alsa-plugins/1.0.26-r0/recipe-sysroot/usr/include/imx/linux/mxc_asrc.h:125:2: error: unknown type name 'snd_pcm_format_t'
      agent:2020/02/10 13:29:56 build.go:220: | snd_pcm_format_t input_format;
      agent:2020/02/10 13:29:56 build.go:220: | ^~~~~~~~~~~~~~~~
      agent:2020/02/10 13:29:56 build.go:220: | /home/qt/work/build/build-nitrogen6x/tmp/work/cortexa9t2hf-neon-mx6qdl-poky-linux-gnueabi/imx-alsa-plugins/1.0.26-r0/recipe-sysroot/usr/include/imx/linux/mxc_asrc.h:126:2: error: unknown type name 'snd_pcm_format_t'
      agent:2020/02/10 13:29:56 build.go:220: | snd_pcm_format_t output_format;
      agent:2020/02/10 13:29:56 build.go:220: | ^~~~~~~~~~~~~~~~
      agent:2020/02/10 13:29:56 build.go:220: | /home/qt/work/build/build-nitrogen6x/tmp/work/cortexa9t2hf-neon-mx6qdl-poky-linux-gnueabi/imx-alsa-plugins/1.0.26-r0/recipe-sysroot/usr/include/imx/linux/mxc_asrc.h:134:2: error: unknown type name 'uint64_t'
      agent:2020/02/10 13:29:56 build.go:220: | uint64_t supported_in_format;
      agent:2020/02/10 13:29:56 build.go:220: | ^~~~~~~~
      agent:2020/02/10 13:29:56 build.go:220: | /home/qt/work/build/build-nitrogen6x/tmp/work/cortexa9t2hf-neon-mx6qdl-poky-linux-gnueabi/imx-alsa-plugins/1.0.26-r0/recipe-sysroot/usr/include/imx/linux/mxc_asrc.h:135:2: error: unknown type name 'uint64_t'
      agent:2020/02/10 13:29:56 build.go:220: | uint64_t supported_out_format;
      agent:2020/02/10 13:29:56 build.go:220: | ^~~~~~~~
      agent:2020/02/10 13:29:56 build.go:220: | ../../git/asrc/asrc_pair.c: In function 'asrc_pair_create':
      agent:2020/02/10 13:29:56 build.go:220: | ../../git/asrc/asrc_pair.c:142:11: error: 'struct asrc_config' has no member named 'buffer_num'
      agent:2020/02/10 13:29:56 build.go:220: | config.buffer_num = buf_num;
      agent:2020/02/10 13:29:56 build.go:220: | ^
      agent:2020/02/10 13:29:56 build.go:220: | ../../git/asrc/asrc_pair.c:143:12: error: 'struct asrc_config' has no member named 'input_word_width'; did you mean 'input_format'?
      agent:2020/02/10 13:29:56 build.go:220: | config.input_word_width = ASRC_WIDTH_16_BIT;
      agent:2020/02/10 13:29:56 build.go:220: | ^~~~~~~~~~~~~~~~
      agent:2020/02/10 13:29:56 build.go:220: | input_format
      agent:2020/02/10 13:29:56 build.go:220: | ../../git/asrc/asrc_pair.c:143:31: error: 'ASRC_WIDTH_16_BIT' undeclared (first use in this function)
      agent:2020/02/10 13:29:56 build.go:220: | config.input_word_width = ASRC_WIDTH_16_BIT;
      agent:2020/02/10 13:29:56 build.go:220: | ^~~~~~~~~~~~~~~~~
      agent:2020/02/10 13:29:56 build.go:220: | ../../git/asrc/asrc_pair.c:143:31: note: each undeclared identifier is reported only once for each function it appears in
      agent:2020/02/10 13:29:56 build.go:220: | ../../git/asrc/asrc_pair.c:144:12: error: 'struct asrc_config' has no member named 'output_word_width'; did you mean 'output_format'?
      agent:2020/02/10 13:29:56 build.go:220: | config.output_word_width = ASRC_WIDTH_16_BIT;
      agent:2020/02/10 13:29:56 build.go:220: | ^~~~~~~~~~~~~~~~~
      agent:2020/02/10 13:29:56 build.go:220: | output_format
      agent:2020/02/10 13:29:56 build.go:220: | ../../git/asrc/asrc_pair.c: In function 'asrc_pair_set_rate':
      agent:2020/02/10 13:29:56 build.go:220: | ../../git/asrc/asrc_pair.c:222:11: error: 'struct asrc_config' has no member named 'buffer_num'
      agent:2020/02/10 13:29:56 build.go:220: | config.buffer_num = buf_num;
      agent:2020/02/10 13:29:56 build.go:220: | ^
      agent:2020/02/10 13:29:56 build.go:220: | ../../git/asrc/asrc_pair.c:223:12: error: 'struct asrc_config' has no member named 'input_word_width'; did you mean 'input_format'?
      agent:2020/02/10 13:29:56 build.go:220: | config.input_word_width = ASRC_WIDTH_16_BIT;
      agent:2020/02/10 13:29:56 build.go:220: | ^~~~~~~~~~~~~~~~
      agent:2020/02/10 13:29:56 build.go:220: | input_format
      agent:2020/02/10 13:29:56 build.go:220: | ../../git/asrc/asrc_pair.c:223:31: error: 'ASRC_WIDTH_16_BIT' undeclared (first use in this function)
      agent:2020/02/10 13:29:56 build.go:220: | config.input_word_width = ASRC_WIDTH_16_BIT;
      agent:2020/02/10 13:29:56 build.go:220: | ^~~~~~~~~~~~~~~~~
      agent:2020/02/10 13:29:56 build.go:220: | ../../git/asrc/asrc_pair.c:224:12: error: 'struct asrc_config' has no member named 'output_word_width'; did you mean 'output_format'?
      agent:2020/02/10 13:29:56 build.go:220: | config.output_word_width = ASRC_WIDTH_16_BIT;
      agent:2020/02/10 13:29:56 build.go:220: | ^~~~~~~~~~~~~~~~~
      agent:2020/02/10 13:29:56 build.go:220: | output_format
      agent:2020/02/10 13:29:56 build.go:220: | Makefile:444: recipe for target 'asrc_pair.lo' failed
      agent:2020/02/10 13:29:56 build.go:220: | make[2]: *** [asrc_pair.lo] Error 1
      agent:2020/02/10 13:29:56 build.go:220: | make[2]: *** Waiting for unfinished jobs....
      agent:2020/02/10 13:29:56 build.go:220: | make[2]: Leaving directory '/home/qt/work/build/build-nitrogen6x/tmp/work/cortexa9t2hf-neon-mx6qdl-poky-linux-gnueabi/imx-alsa-plugins/1.0.26-r0/build/asrc'
      agent:2020/02/10 13:29:56 build.go:220: | Makefile:402: recipe for target 'all-recursive' failed
      agent:2020/02/10 13:29:56 build.go:220: | make[1]: *** [all-recursive] Error 1
      agent:2020/02/10 13:29:56 build.go:220: | make[1]: Leaving directory '/home/qt/work/build/build-nitrogen6x/tmp/work/cortexa9t2hf-neon-mx6qdl-poky-linux-gnueabi/imx-alsa-plugins/1.0.26-r0/build'
      agent:2020/02/10 13:29:56 build.go:220: | Makefile:334: recipe for target 'all' failed
      agent:2020/02/10 13:29:56 build.go:220: | make: *** [all] Error 2
      agent:2020/02/10 13:29:56 build.go:220: | ERROR: oe_runmake failed
      agent:2020/02/10 13:29:56 build.go:220: | WARNING: exit code 1 from a shell command.
      agent:2020/02/10 13:29:56 build.go:220: | ERROR: Function failed: do_compile (log file is located at /home/qt/work/build/build-nitrogen6x/tmp/work/cortexa9t2hf-neon-mx6qdl-poky-linux-gnueabi/imx-alsa-plugins/1.0.26-r0/temp/log.do_compile.17846)
      agent:2020/02/10 13:29:56 build.go:220: NOTE: recipe imx-alsa-plugins-1.0.26-r0: task do_compile: Failed

        Attachments

        No reviews matched the request. Check your Options in the drop-down menu of this sections header.

          Activity

            People

            Assignee:
            sapiippo Samuli Piippo
            Reporter:
            jujokini Jukka Jokiniva
            Votes:
            0 Vote for this issue
            Watchers:
            3 Start watching this issue

              Dates

              Created:
              Updated:
              Resolved:

                Gerrit Reviews

                There are no open Gerrit changes