Uploaded image for project: 'Qt Automotive Suite'
  1. Qt Automotive Suite
  2. AUTOSUITE-1484

QtApplicationManager 5.14 fails on Yocto build

    XMLWordPrintable

    Details

    • Type: Bug
    • Status: Closed
    • Priority: P0: Blocker
    • Resolution: Done
    • Affects Version/s: 5.14.1
    • Fix Version/s: 5.15.0
    • Component/s: Qt Application Manager
    • Labels:
      None
    • Commits:
      6a1553e451890580db06b2c2d4939203ac349f8b (qt/qtapplicationmanager/5.13) d9d8524f6ef733a480c5234129f30f639055ae10 (qt/qtapplicationmanager/5.14)

      Description

      QtApplicationManager SHA1: 4cf198fbb27de39afcee48045025edcb9cb112dc

       
      20:13:59 | make[1]: Leaving directory '/home/qt/work/build/tmp/work/i686-nativesdk-mingw32-pokysdk-mingw32/nativesdk-qtapplicationmanager/5.14.1+gitAUTOINC+4cf198fbb2-r0/build/3rdparty/libarchive'
      20:13:59 | cd src/ && ( test -e Makefile || /home/qt/work/build/tmp/work/i686-nativesdk-mingw32-pokysdk-mingw32/nativesdk-qtapplicationmanager/5.14.1+gitAUTOINC+4cf198fbb2-r0/recipe-sysroot-native/usr/bin/qmake -o Makefile /home/qt/work/build/tmp/work/i686-nativesdk-mingw32-pokysdk-mingw32/nativesdk-qtapplicationmanager/5.14.1+gitAUTOINC+4cf198fbb2-r0/git/src/src.pro -config tools-only ) && make -f Makefile
      20:13:59 | make[1]: Entering directory '/home/qt/work/build/tmp/work/i686-nativesdk-mingw32-pokysdk-mingw32/nativesdk-qtapplicationmanager/5.14.1+gitAUTOINC+4cf198fbb2-r0/build/src'
      20:13:59 | cd common-lib/ && ( test -e Makefile || /home/qt/work/build/tmp/work/i686-nativesdk-mingw32-pokysdk-mingw32/nativesdk-qtapplicationmanager/5.14.1+gitAUTOINC+4cf198fbb2-r0/recipe-sysroot-native/usr/bin/qmake -o Makefile /home/qt/work/build/tmp/work/i686-nativesdk-mingw32-pokysdk-mingw32/nativesdk-qtapplicationmanager/5.14.1+gitAUTOINC+4cf198fbb2-r0/git/src/common-lib/common-lib.pro -config tools-only ) && make -f Makefile
      20:13:59 | <srcbase> = /home/qt/work/build/tmp/work/i686-nativesdk-mingw32-pokysdk-mingw32/nativesdk-qtapplicationmanager/5.14.1+gitAUTOINC+4cf198fbb2-r0/git
      20:13:59 | <bldbase> = /home/qt/work/build/tmp/work/i686-nativesdk-mingw32-pokysdk-mingw32/nativesdk-qtapplicationmanager/5.14.1+gitAUTOINC+4cf198fbb2-r0/build
      20:13:59 | <outbase> = /home/qt/work/build/tmp/work/i686-nativesdk-mingw32-pokysdk-mingw32/nativesdk-qtapplicationmanager/5.14.1+gitAUTOINC+4cf198fbb2-r0/build
      20:13:59 | QtAppManCommon: created fwd-include header(s) for <srcbase>/src/common-lib/ { configcache.h (1), configcache_p.h (1), crashhandler.h (1), dbus-utilities.h (1), error.h (1), exception.h (1), global.h (1), logging.h (1), processtitle.h (1), qml-utilities.h (1), qtyaml.h (1), startuptimer.h (1), unixsignalhandler.h (1), utilities.h (1) }
      20:13:59 | QtAppManCommon: created version header
      20:13:59 | QtAppManCommon: created master header
      20:13:59 | QtAppManCommon: created headers.pri file
      20:13:59 | make[2]: Entering directory '/home/qt/work/build/tmp/work/i686-nativesdk-mingw32-pokysdk-mingw32/nativesdk-qtapplicationmanager/5.14.1+gitAUTOINC+4cf198fbb2-r0/build/src/common-lib'
      20:13:59 | compiling /home/qt/work/build/tmp/work/i686-nativesdk-mingw32-pokysdk-mingw32/nativesdk-qtapplicationmanager/5.14.1+gitAUTOINC+4cf198fbb2-r0/git/src/common-lib/exception.cpp
      20:13:59 | compiling /home/qt/work/build/tmp/work/i686-nativesdk-mingw32-pokysdk-mingw32/nativesdk-qtapplicationmanager/5.14.1+gitAUTOINC+4cf198fbb2-r0/git/src/common-lib/utilities.cpp
      20:13:59 | compiling /home/qt/work/build/tmp/work/i686-nativesdk-mingw32-pokysdk-mingw32/nativesdk-qtapplicationmanager/5.14.1+gitAUTOINC+4cf198fbb2-r0/git/src/common-lib/qtyaml.cpp
      20:13:59 | compiling /home/qt/work/build/tmp/work/i686-nativesdk-mingw32-pokysdk-mingw32/nativesdk-qtapplicationmanager/5.14.1+gitAUTOINC+4cf198fbb2-r0/git/src/common-lib/processtitle.cpp
      20:13:59 | compiling /home/qt/work/build/tmp/work/i686-nativesdk-mingw32-pokysdk-mingw32/nativesdk-qtapplicationmanager/5.14.1+gitAUTOINC+4cf198fbb2-r0/git/src/common-lib/startuptimer.cpp
      20:13:59 | compiling /home/qt/work/build/tmp/work/i686-nativesdk-mingw32-pokysdk-mingw32/nativesdk-qtapplicationmanager/5.14.1+gitAUTOINC+4cf198fbb2-r0/git/src/common-lib/crashhandler.cpp
      20:13:59 | compiling /home/qt/work/build/tmp/work/i686-nativesdk-mingw32-pokysdk-mingw32/nativesdk-qtapplicationmanager/5.14.1+gitAUTOINC+4cf198fbb2-r0/git/src/common-lib/unixsignalhandler.cpp
      20:13:59 | compiling /home/qt/work/build/tmp/work/i686-nativesdk-mingw32-pokysdk-mingw32/nativesdk-qtapplicationmanager/5.14.1+gitAUTOINC+4cf198fbb2-r0/git/src/common-lib/logging.cpp
      20:13:59 | /home/qt/work/build/tmp/work/i686-nativesdk-mingw32-pokysdk-mingw32/nativesdk-qtapplicationmanager/5.14.1+gitAUTOINC+4cf198fbb2-r0/git/src/common-lib/logging.cpp:64:12: fatal error: Windows.h: No such file or directory
      20:13:59 | # include <Windows.h>
      20:13:59 | ^~~~~~~~~~~
      20:13:59 | compilation terminated.
      20:13:59 | Makefile:507: recipe for target '.obj/logging.o' failed
      20:13:59 | make[2]: *** [.obj/logging.o] Error 1
      20:13:59 | make[2]: *** Waiting for unfinished jobs....
      20:13:59 | /home/qt/work/build/tmp/work/i686-nativesdk-mingw32-pokysdk-mingw32/nativesdk-qtapplicationmanager/5.14.1+gitAUTOINC+4cf198fbb2-r0/git/src/common-lib/crashhandler.cpp:548:12: fatal error: Windows.h: No such file or directory
      20:13:59 | # include <Windows.h>
      20:13:59 | ^~~~~~~~~~~
      20:13:59 | compilation terminated.
      20:13:59 | Makefile:500: recipe for target '.obj/crashhandler.o' failed
      20:13:59 | make[2]: *** [.obj/crashhandler.o] Error 1
      20:13:59 | /home/qt/work/build/tmp/work/i686-nativesdk-mingw32-pokysdk-mingw32/nativesdk-qtapplicationmanager/5.14.1+gitAUTOINC+4cf198fbb2-r0/git/src/common-lib/utilities.cpp:62:12: fatal error: Windows.h: No such file or directory
      20:13:59 | # include <Windows.h>
      20:13:59 | ^~~~~~~~~~~
      20:13:59 | compilation terminated.
      20:13:59 | Makefile:460: recipe for target '.obj/utilities.o' failed
      20:13:59 | make[2]: *** [.obj/utilities.o] Error 1
      20:13:59 | make[2]: Leaving directory '/home/qt/work/build/tmp/work/i686-nativesdk-mingw32-pokysdk-mingw32/nativesdk-qtapplicationmanager/5.14.1+gitAUTOINC+4cf198fbb2-r0/build/src/common-lib'
      20:13:59 | Makefile:55: recipe for target 'sub-common-lib-make_first' failed
      20:13:59 | make[1]: *** [sub-common-lib-make_first] Error 2
      20:13:59 | make[1]: Leaving directory '/home/qt/work/build/tmp/work/i686-nativesdk-mingw32-pokysdk-mingw32/nativesdk-qtapplicationmanager/5.14.1+gitAUTOINC+4cf198fbb2-r0/build/src'
      20:13:59 | Makefile:225: recipe for target 'sub-src-make_first-ordered' failed
      20:13:59 | make: *** [sub-src-make_first-ordered] Error 2
      20:13:59 | ERROR: oe_runmake failed
      20:13:59 | WARNING: exit code 1 from a shell command.
      20:13:59 | ERROR: Function failed: do_compile (log file is located at /home/qt/work/build/tmp/work/i686-nativesdk-mingw32-pokysdk-mingw32/nativesdk-qtapplicationmanager/5.14.1+gitAUTOINC+4cf198fbb2-r0/temp/log.do_compile.1920)
      20:13:59 NOTE: recipe nativesdk-qtapplicationmanager-5.14.1+gitAUTOINC+4cf198fbb2-r0: task do_compile: Failed
      20:13:59 ERROR: Task (virtual:nativesdk:/home/qt/work/sources/meta-boot2qt/meta-boot2qt/recipes-qt/automotive/qtapplicationmanager_git.bb:do_compile) failed with exit code '1'
      20:14:01 NOTE: recipe nativesdk-qtsaferenderer-1.1.2-r0: task do_package: Succeeded
      20:14:28 NOTE: recipe core-image-minimal-initramfs-1.0-r0: task do_rootfs: Succeeded
      20:14:29 NOTE: Tasks Summary: Attempted 6971 tasks of which 6887 didn't need to be rerun and 1 failed.

        Attachments

        No reviews matched the request. Check your Options in the drop-down menu of this sections header.

          Activity

            People

            Assignee:
            rgriebl Robert Griebl
            Reporter:
            jujokini Jukka Jokiniva
            Votes:
            0 Vote for this issue
            Watchers:
            3 Start watching this issue

              Dates

              Created:
              Updated:
              Resolved:

                Gerrit Reviews

                There are no open Gerrit changes