Uploaded image for project: 'Qt for Python'
  1. Qt for Python
  2. PYSIDE-505

Error while building pyside2 / Qt 5.8 against source package

    XMLWordPrintable

    Details

    • Type: Bug
    • Status: Closed
    • Priority: P3: Somewhat important
    • Resolution: Duplicate
    • Affects Version/s: None
    • Fix Version/s: 6.0
    • Component/s: PySide
    • Labels:
    • Environment:

      Description

      Hi,

      I get a compilation error while building PySide2:

      src/multimedia/qtmultimediadefs.h not found
      
      (pyside2) filippo@savage:~/tmp/pyside2/src/pyside-setup$ python setup.py build --qmake=/home/filippo/Qt/5.8/gcc_64/bin/qmake  --openssl=/usr/bin/openssl --build-tests --ignore-git
      
      running build
      Removing /home/filippo/tmp/pyside2/src/pyside-setup/pyside_package
      Python architecture is 64bit
      Inserting path "/home/filippo/Qt/5.8/gcc_64/bin" to environment
      Inserting path "/home/filippo/tmp/pyside2/src/pyside-setup/pyside22_install/py2.7-qt5.8.0-64bit-release/bin" to environment
      ==============================
      Package version: 2.0.0.dev0
      Build type: Release
      Build tests: True
      ---
      Make path: /usr/bin/make
      Make generator: Unix Makefiles
      Make jobs: 
      ---
      Script directory: /home/filippo/tmp/pyside2/src/pyside-setup
      Sources directory: /home/filippo/tmp/pyside2/src/pyside-setup/sources
      Build directory: /home/filippo/tmp/pyside2/src/pyside-setup/pyside22_build/py2.7-qt5.8.0-64bit-release
      Install directory: /home/filippo/tmp/pyside2/src/pyside-setup/pyside22_install/py2.7-qt5.8.0-64bit-release
      Python site-packages install directory: /home/filippo/tmp/pyside2/src/pyside-setup/pyside22_install/py2.7-qt5.8.0-64bit-release/lib/python2.7/site-packages
      ---
      Python executable: /home/filippo/tmp/pyside2/bin/python
      Python includes: /usr/include/python2.7
      Python library: /usr/lib/x86_64-linux-gnu/libpython2.7.so
      Python prefix: /home/filippo/tmp/pyside2
      Python scripts: /home/filippo/tmp/pyside2/bin
      ---
      Qt qmake: /home/filippo/Qt/5.8/gcc_64/bin/qmake
      Qt version: 5.8.0
      Qt bins: /home/filippo/Qt/5.8/gcc_64/bin
      Qt docs: /home/filippo/Qt/Docs/Qt-5.8
      Qt plugins: /home/filippo/Qt/5.8/gcc_64/plugins
      ---
      OpenSSL libs: /usr/bin/openssl
      ==============================
      Creating build folder /home/filippo/tmp/pyside2/src/pyside-setup/pyside22_build/py2.7-qt5.8.0-64bit-release...
      Creating install folder /home/filippo/tmp/pyside2/src/pyside-setup/pyside22_install/py2.7-qt5.8.0-64bit-release...
      Building module shiboken2...
      Creating module build folder /home/filippo/tmp/pyside2/src/pyside-setup/pyside22_build/py2.7-qt5.8.0-64bit-release/shiboken2...
      Configuring module shiboken2 (/home/filippo/tmp/pyside2/src/pyside-setup/sources/shiboken2)...
      Running process in /home/filippo/tmp/pyside2/src/pyside-setup/pyside22_build/py2.7-qt5.8.0-64bit-release/shiboken2: /usr/bin/cmake -G "Unix Makefiles" -DQT_QMAKE_EXECUTABLE='/home/filippo/Qt/5.8/gcc_64/bin/qmake' -DBUILD_TESTS=True -DQt5Help_DIR=/home/filippo/Qt/Docs/Qt-5.8 -DCMAKE_BUILD_TYPE=Release -DCMAKE_INSTALL_PREFIX=/home/filippo/tmp/pyside2/src/pyside-setup/pyside22_install/py2.7-qt5.8.0-64bit-release /home/filippo/tmp/pyside2/src/pyside-setup/sources/shiboken2 -DPYTHON_EXECUTABLE=/home/filippo/tmp/pyside2/bin/python -DPYTHON_INCLUDE_DIR=/usr/include/python2.7 -DPYTHON_LIBRARY=/usr/lib/x86_64-linux-gnu/libpython2.7.so -DQT_SRC_DIR=/home/filippo/Qt/5.8/gcc_64 -DCMAKE_INSTALL_RPATH_USE_LINK_PATH=yes
      /usr/bin/cmake -G Unix Makefiles -DQT_QMAKE_EXECUTABLE='/home/filippo/Qt/5.8/gcc_64/bin/qmake' -DBUILD_TESTS=True -DQt5Help_DIR=/home/filippo/Qt/Docs/Qt-5.8 -DCMAKE_BUILD_TYPE=Release -DCMAKE_INSTALL_PREFIX=/home/filippo/tmp/pyside2/src/pyside-setup/pyside22_install/py2.7-qt5.8.0-64bit-release /home/filippo/tmp/pyside2/src/pyside-setup/sources/shiboken2 -DPYTHON_EXECUTABLE=/home/filippo/tmp/pyside2/bin/python -DPYTHON_INCLUDE_DIR=/usr/include/python2.7 -DPYTHON_LIBRARY=/usr/lib/x86_64-linux-gnu/libpython2.7.so -DQT_SRC_DIR=/home/filippo/Qt/5.8/gcc_64 -DCMAKE_INSTALL_RPATH_USE_LINK_PATH=yes
      -- The C compiler identification is GNU 5.4.0
      -- The CXX compiler identification is GNU 5.4.0
      -- Check for working C compiler: /usr/bin/cc
      -- Check for working C compiler: /usr/bin/cc -- works
      -- Detecting C compiler ABI info
      -- Detecting C compiler ABI info - done
      -- Detecting C compile features
      -- Detecting C compile features - done
      -- Check for working CXX compiler: /usr/bin/c++
      -- Check for working CXX compiler: /usr/bin/c++ -- works
      -- Detecting CXX compiler ABI info
      -- Detecting CXX compiler ABI info - done
      -- Detecting CXX compile features
      -- Detecting CXX compile features - done
      -- Found PythonLibs: /usr/lib/x86_64-linux-gnu/libpython2.7.so (found suitable version "2.7.12", minimum required is "2.6") 
      -- Found PythonInterp: /home/filippo/tmp/pyside2/bin/python (found suitable version "2.7.12", minimum required is "2.6") 
      -- CLANG: /home/filippo/tmp/pyside2/tmp/libclang, /home/filippo/tmp/pyside2/tmp/libclang/lib/libclang.so
      PYTHONLIBS_FOUND: TRUE
      PYTHON_LIBRARIES: /usr/lib/x86_64-linux-gnu/libpython2.7.so
      PYTHON_INCLUDE_DIRS: /usr/include/python2.7
      PYTHON_DEBUG_LIBRARIES: 
      PYTHONINTERP_FOUND: TRUE
      PYTHON_EXECUTABLE: /home/filippo/tmp/pyside2/bin/python
      PYTHON_VERSION: 2.7.12
      PYTHON_MULTIARCH_SUFFIX: x86_64-linux-gnu
      PYTHON_MODULE_RELEASE_SUFFIX: 
      -- PYTHON_EXTENSION_SUFFIX: .x86_64-linux-gnu
      -- Found LibXml2: /usr/lib/x86_64-linux-gnu/libxml2.so (found suitable version "2.9.3", minimum required is "2.6.32") 
      -- Found LibXslt: /usr/lib/x86_64-linux-gnu/libxslt.so (found suitable version "1.1.28", minimum required is "1.1.19") 
      -- sphinx-build - found
      CMake Warning (dev) at /home/filippo/Qt/5.8/gcc_64/lib/cmake/Qt5/Qt5ModuleLocation.cmake:4 (set):
        Policy CMP0053 is not set: Simplify variable reference and escape sequence
        evaluation.  Run "cmake --help-policy CMP0053" for policy details.  Use the
        cmake_policy command to set the policy and suppress this warning.
      
        For input:
      
          '${_qt5_install_prefix}/Qt5@module@/Qt5@module@Config.cmake'
      
        the old evaluation rules produce:
      
          '/home/filippo/Qt/5.8/gcc_64/lib/cmake/Qt5/Qt5Config.cmake'
      
        but the new evaluation rules produce:
      
          '/home/filippo/Qt/5.8/gcc_64/lib/cmake/Qt5@module@/Qt5@module@Config.cmake'
      
        Using the old result for compatibility since the policy is not set.
      Call Stack (most recent call first):
        /home/filippo/Qt/5.8/gcc_64/lib/cmake/Qt5/Qt5Config.cmake:25 (include)
        tests/CMakeLists.txt:1 (find_package)
      This warning is for project developers.  Use -Wno-dev to suppress it.
      
      -- Tests will be generated using the protected hack!
      -- Found PythonInterp: /home/filippo/tmp/pyside2/bin/python (found version "2.7.12") 
      -- Configuring done
      -- Generating done
      CMake Warning:
        Manually-specified variables were not used by the project:
      
          QT_QMAKE_EXECUTABLE
          QT_SRC_DIR
          Qt5Help_DIR
      
      
      -- Build files have been written to: /home/filippo/tmp/pyside2/src/pyside-setup/pyside22_build/py2.7-qt5.8.0-64bit-release/shiboken2
      Compiling module shiboken2...
      Running process in /home/filippo/tmp/pyside2/src/pyside-setup/pyside22_build/py2.7-qt5.8.0-64bit-release/shiboken2: /usr/bin/make
      /usr/bin/make
      Scanning dependencies of target apiextractor_automoc
      [  0%] Automatic moc for target apiextractor
      Generating moc_abstractmetalang.cpp
      Generating moc_typesystem.cpp
      [  0%] Built target apiextractor_automoc
      Scanning dependencies of target apiextractor
      [  0%] Building CXX object ApiExtractor/CMakeFiles/apiextractor.dir/apiextractor.cpp.o
      [  0%] Building CXX object ApiExtractor/CMakeFiles/apiextractor.dir/abstractmetabuilder.cpp.o
      [  0%] Building CXX object ApiExtractor/CMakeFiles/apiextractor.dir/abstractmetalang.cpp.o
      [  1%] Building CXX object ApiExtractor/CMakeFiles/apiextractor.dir/fileout.cpp.o
      [  1%] Building CXX object ApiExtractor/CMakeFiles/apiextractor.dir/graph.cpp.o
      [  1%] Building CXX object ApiExtractor/CMakeFiles/apiextractor.dir/reporthandler.cpp.o
      [  1%] Building CXX object ApiExtractor/CMakeFiles/apiextractor.dir/typeparser.cpp.o
      [  2%] Building CXX object ApiExtractor/CMakeFiles/apiextractor.dir/typesystem.cpp.o
      [  2%] Building CXX object ApiExtractor/CMakeFiles/apiextractor.dir/include.cpp.o
      [  2%] Building CXX object ApiExtractor/CMakeFiles/apiextractor.dir/typedatabase.cpp.o
      [  2%] Building CXX object ApiExtractor/CMakeFiles/apiextractor.dir/clangparser/compilersupport.cpp.o
      [  3%] Building CXX object ApiExtractor/CMakeFiles/apiextractor.dir/clangparser/clangparser.cpp.o
      [  3%] Building CXX object ApiExtractor/CMakeFiles/apiextractor.dir/clangparser/clangbuilder.cpp.o
      [  3%] Building CXX object ApiExtractor/CMakeFiles/apiextractor.dir/clangparser/clangdebugutils.cpp.o
      [  3%] Building CXX object ApiExtractor/CMakeFiles/apiextractor.dir/clangparser/clangutils.cpp.o
      [  4%] Building CXX object ApiExtractor/CMakeFiles/apiextractor.dir/parser/codemodel.cpp.o
      [  4%] Building CXX object ApiExtractor/CMakeFiles/apiextractor.dir/docparser.cpp.o
      [  4%] Building CXX object ApiExtractor/CMakeFiles/apiextractor.dir/doxygenparser.cpp.o
      [  4%] Building CXX object ApiExtractor/CMakeFiles/apiextractor.dir/qtdocparser.cpp.o
      [  5%] Building CXX object ApiExtractor/CMakeFiles/apiextractor.dir/apiextractor_automoc.cpp.o
      [  5%] Linking CXX static library ../tests/libapiextractor.a
      [  5%] Built target apiextractor
      Scanning dependencies of target testmodifydocumentation_automoc
      [  6%] Automatic moc for target testmodifydocumentation
      Generating moc_testmodifydocumentation.cpp
      [  6%] Built target testmodifydocumentation_automoc
      Scanning dependencies of target testmodifydocumentation
      [  6%] Building CXX object ApiExtractor/tests/CMakeFiles/testmodifydocumentation.dir/testmodifydocumentation.cpp.o
      [  6%] Building CXX object ApiExtractor/tests/CMakeFiles/testmodifydocumentation.dir/testmodifydocumentation_automoc.cpp.o
      [  6%] Linking CXX executable testmodifydocumentation
      [  6%] Built target testmodifydocumentation
      Scanning dependencies of target testtyperevision_automoc
      [  6%] Automatic moc for target testtyperevision
      Generating moc_testtyperevision.cpp
      [  6%] Built target testtyperevision_automoc
      Scanning dependencies of target testtyperevision
      [  7%] Building CXX object ApiExtractor/tests/CMakeFiles/testtyperevision.dir/testtyperevision.cpp.o
      [  7%] Building CXX object ApiExtractor/tests/CMakeFiles/testtyperevision.dir/testtyperevision_automoc.cpp.o
      [  7%] Linking CXX executable testtyperevision
      [  7%] Built target testtyperevision
      Scanning dependencies of target testvoidarg_automoc
      [  8%] Automatic moc for target testvoidarg
      Generating moc_testvoidarg.cpp
      [  8%] Built target testvoidarg_automoc
      Scanning dependencies of target testvoidarg
      [  9%] Building CXX object ApiExtractor/tests/CMakeFiles/testvoidarg.dir/testvoidarg.cpp.o
      [  9%] Building CXX object ApiExtractor/tests/CMakeFiles/testvoidarg.dir/testvoidarg_automoc.cpp.o
      [  9%] Linking CXX executable testvoidarg
      [  9%] Built target testvoidarg
      Scanning dependencies of target testvaluetypedefaultctortag_automoc
      [  9%] Automatic moc for target testvaluetypedefaultctortag
      Generating moc_testvaluetypedefaultctortag.cpp
      [  9%] Built target testvaluetypedefaultctortag_automoc
      Scanning dependencies of target testvaluetypedefaultctortag
      [ 10%] Building CXX object ApiExtractor/tests/CMakeFiles/testvaluetypedefaultctortag.dir/testvaluetypedefaultctortag.cpp.o
      [ 10%] Building CXX object ApiExtractor/tests/CMakeFiles/testvaluetypedefaultctortag.dir/testvaluetypedefaultctortag_automoc.cpp.o
      [ 10%] Linking CXX executable testvaluetypedefaultctortag
      [ 10%] Built target testvaluetypedefaultctortag
      Scanning dependencies of target testtemplates_automoc
      [ 10%] Automatic moc for target testtemplates
      Generating moc_testtemplates.cpp
      [ 10%] Built target testtemplates_automoc
      Scanning dependencies of target testtemplates
      [ 11%] Building CXX object ApiExtractor/tests/CMakeFiles/testtemplates.dir/testtemplates.cpp.o
      [ 11%] Building CXX object ApiExtractor/tests/CMakeFiles/testtemplates.dir/testtemplates_automoc.cpp.o
      [ 11%] Linking CXX executable testtemplates
      [ 11%] Built target testtemplates
      Scanning dependencies of target testtoposort_automoc
      [ 11%] Automatic moc for target testtoposort
      Generating moc_testtoposort.cpp
      [ 11%] Built target testtoposort_automoc
      Scanning dependencies of target testtoposort
      [ 12%] Building CXX object ApiExtractor/tests/CMakeFiles/testtoposort.dir/testtoposort.cpp.o
      [ 12%] Building CXX object ApiExtractor/tests/CMakeFiles/testtoposort.dir/testtoposort_automoc.cpp.o
      [ 12%] Linking CXX executable testtoposort
      [ 12%] Built target testtoposort
      Scanning dependencies of target testresolvetype_automoc
      [ 12%] Automatic moc for target testresolvetype
      Generating moc_testresolvetype.cpp
      [ 12%] Built target testresolvetype_automoc
      Scanning dependencies of target testresolvetype
      [ 12%] Building CXX object ApiExtractor/tests/CMakeFiles/testresolvetype.dir/testresolvetype.cpp.o
      [ 13%] Building CXX object ApiExtractor/tests/CMakeFiles/testresolvetype.dir/testresolvetype_automoc.cpp.o
      [ 13%] Linking CXX executable testresolvetype
      [ 13%] Built target testresolvetype
      Scanning dependencies of target testreferencetopointer_automoc
      [ 13%] Automatic moc for target testreferencetopointer
      Generating moc_testreferencetopointer.cpp
      [ 13%] Built target testreferencetopointer_automoc
      Scanning dependencies of target testreferencetopointer
      [ 13%] Building CXX object ApiExtractor/tests/CMakeFiles/testreferencetopointer.dir/testreferencetopointer.cpp.o
      [ 14%] Building CXX object ApiExtractor/tests/CMakeFiles/testreferencetopointer.dir/testreferencetopointer_automoc.cpp.o
      [ 14%] Linking CXX executable testreferencetopointer
      [ 14%] Built target testreferencetopointer
      Scanning dependencies of target testrefcounttag_automoc
      [ 14%] Automatic moc for target testrefcounttag
      Generating moc_testrefcounttag.cpp
      [ 14%] Built target testrefcounttag_automoc
      Scanning dependencies of target testrefcounttag
      [ 14%] Building CXX object ApiExtractor/tests/CMakeFiles/testrefcounttag.dir/testrefcounttag.cpp.o
      [ 15%] Building CXX object ApiExtractor/tests/CMakeFiles/testrefcounttag.dir/testrefcounttag_automoc.cpp.o
      [ 15%] Linking CXX executable testrefcounttag
      [ 15%] Built target testrefcounttag
      Scanning dependencies of target testremoveoperatormethod_automoc
      [ 15%] Automatic moc for target testremoveoperatormethod
      Generating moc_testremoveoperatormethod.cpp
      [ 15%] Built target testremoveoperatormethod_automoc
      Scanning dependencies of target testremoveoperatormethod
      [ 15%] Building CXX object ApiExtractor/tests/CMakeFiles/testremoveoperatormethod.dir/testremoveoperatormethod.cpp.o
      [ 16%] Building CXX object ApiExtractor/tests/CMakeFiles/testremoveoperatormethod.dir/testremoveoperatormethod_automoc.cpp.o
      [ 16%] Linking CXX executable testremoveoperatormethod
      [ 16%] Built target testremoveoperatormethod
      Scanning dependencies of target testdroptypeentries_automoc
      [ 16%] Automatic moc for target testdroptypeentries
      Generating moc_testdroptypeentries.cpp
      [ 16%] Built target testdroptypeentries_automoc
      Scanning dependencies of target testdroptypeentries
      [ 17%] Building CXX object ApiExtractor/tests/CMakeFiles/testdroptypeentries.dir/testdroptypeentries.cpp.o
      [ 17%] Building CXX object ApiExtractor/tests/CMakeFiles/testdroptypeentries.dir/testdroptypeentries_automoc.cpp.o
      [ 17%] Linking CXX executable testdroptypeentries
      [ 17%] Built target testdroptypeentries
      Scanning dependencies of target testremoveimplconv_automoc
      [ 17%] Automatic moc for target testremoveimplconv
      Generating moc_testremoveimplconv.cpp
      [ 17%] Built target testremoveimplconv_automoc
      Scanning dependencies of target testremoveimplconv
      [ 17%] Building CXX object ApiExtractor/tests/CMakeFiles/testremoveimplconv.dir/testremoveimplconv.cpp.o
      [ 18%] Building CXX object ApiExtractor/tests/CMakeFiles/testremoveimplconv.dir/testremoveimplconv_automoc.cpp.o
      [ 18%] Linking CXX executable testremoveimplconv
      [ 18%] Built target testremoveimplconv
      Scanning dependencies of target testctorinformation_automoc
      [ 18%] Automatic moc for target testctorinformation
      Generating moc_testctorinformation.cpp
      [ 18%] Built target testctorinformation_automoc
      Scanning dependencies of target testctorinformation
      [ 19%] Building CXX object ApiExtractor/tests/CMakeFiles/testctorinformation.dir/testctorinformation.cpp.o
      [ 19%] Building CXX object ApiExtractor/tests/CMakeFiles/testctorinformation.dir/testctorinformation_automoc.cpp.o
      [ 19%] Linking CXX executable testctorinformation
      [ 19%] Built target testctorinformation
      Scanning dependencies of target testconversionruletag_automoc
      [ 19%] Automatic moc for target testconversionruletag
      Generating moc_testconversionruletag.cpp
      [ 19%] Built target testconversionruletag_automoc
      Scanning dependencies of target testconversionruletag
      [ 20%] Building CXX object ApiExtractor/tests/CMakeFiles/testconversionruletag.dir/testconversionruletag.cpp.o
      [ 20%] Building CXX object ApiExtractor/tests/CMakeFiles/testconversionruletag.dir/testconversionruletag_automoc.cpp.o
      [ 20%] Linking CXX executable testconversionruletag
      [ 20%] Built target testconversionruletag
      Scanning dependencies of target testconversionoperator_automoc
      [ 20%] Automatic moc for target testconversionoperator
      Generating moc_testconversionoperator.cpp
      [ 20%] Built target testconversionoperator_automoc
      Scanning dependencies of target testconversionoperator
      [ 21%] Building CXX object ApiExtractor/tests/CMakeFiles/testconversionoperator.dir/testconversionoperator.cpp.o
      [ 21%] Building CXX object ApiExtractor/tests/CMakeFiles/testconversionoperator.dir/testconversionoperator_automoc.cpp.o
      [ 21%] Linking CXX executable testconversionoperator
      [ 21%] Built target testconversionoperator
      Scanning dependencies of target testabstractmetaclass_automoc
      [ 21%] Automatic moc for target testabstractmetaclass
      Generating moc_testabstractmetaclass.cpp
      [ 21%] Built target testabstractmetaclass_automoc
      Scanning dependencies of target testabstractmetaclass
      [ 21%] Building CXX object ApiExtractor/tests/CMakeFiles/testabstractmetaclass.dir/testabstractmetaclass.cpp.o
      [ 22%] Building CXX object ApiExtractor/tests/CMakeFiles/testabstractmetaclass.dir/testabstractmetaclass_automoc.cpp.o
      [ 22%] Linking CXX executable testabstractmetaclass
      [ 22%] Built target testabstractmetaclass
      Scanning dependencies of target testreverseoperators_automoc
      [ 22%] Automatic moc for target testreverseoperators
      Generating moc_testreverseoperators.cpp
      [ 22%] Built target testreverseoperators_automoc
      Scanning dependencies of target testreverseoperators
      [ 23%] Building CXX object ApiExtractor/tests/CMakeFiles/testreverseoperators.dir/testreverseoperators.cpp.o
      [ 23%] Building CXX object ApiExtractor/tests/CMakeFiles/testreverseoperators.dir/testreverseoperators_automoc.cpp.o
      [ 23%] Linking CXX executable testreverseoperators
      [ 23%] Built target testreverseoperators
      Scanning dependencies of target testimplicitconversions_automoc
      [ 24%] Automatic moc for target testimplicitconversions
      Generating moc_testimplicitconversions.cpp
      [ 24%] Built target testimplicitconversions_automoc
      Scanning dependencies of target testimplicitconversions
      [ 24%] Building CXX object ApiExtractor/tests/CMakeFiles/testimplicitconversions.dir/testimplicitconversions.cpp.o
      [ 24%] Building CXX object ApiExtractor/tests/CMakeFiles/testimplicitconversions.dir/testimplicitconversions_automoc.cpp.o
      [ 24%] Linking CXX executable testimplicitconversions
      [ 24%] Built target testimplicitconversions
      Scanning dependencies of target testabstractmetatype_automoc
      [ 24%] Automatic moc for target testabstractmetatype
      Generating moc_testabstractmetatype.cpp
      [ 24%] Built target testabstractmetatype_automoc
      Scanning dependencies of target testabstractmetatype
      [ 24%] Building CXX object ApiExtractor/tests/CMakeFiles/testabstractmetatype.dir/testabstractmetatype.cpp.o
      [ 25%] Building CXX object ApiExtractor/tests/CMakeFiles/testabstractmetatype.dir/testabstractmetatype_automoc.cpp.o
      [ 25%] Linking CXX executable testabstractmetatype
      [ 25%] Built target testabstractmetatype
      Scanning dependencies of target testaddfunction_automoc
      [ 25%] Automatic moc for target testaddfunction
      Generating moc_testaddfunction.cpp
      [ 25%] Built target testaddfunction_automoc
      Scanning dependencies of target testaddfunction
      [ 25%] Building CXX object ApiExtractor/tests/CMakeFiles/testaddfunction.dir/testaddfunction.cpp.o
      [ 26%] Building CXX object ApiExtractor/tests/CMakeFiles/testaddfunction.dir/testaddfunction_automoc.cpp.o
      [ 26%] Linking CXX executable testaddfunction
      [ 26%] Built target testaddfunction
      Scanning dependencies of target testcontainer_automoc
      [ 26%] Automatic moc for target testcontainer
      Generating moc_testcontainer.cpp
      [ 26%] Built target testcontainer_automoc
      Scanning dependencies of target testcontainer
      [ 27%] Building CXX object ApiExtractor/tests/CMakeFiles/testcontainer.dir/testcontainer.cpp.o
      [ 27%] Building CXX object ApiExtractor/tests/CMakeFiles/testcontainer.dir/testcontainer_automoc.cpp.o
      [ 27%] Linking CXX executable testcontainer
      [ 27%] Built target testcontainer
      Scanning dependencies of target testarrayargument_automoc
      [ 27%] Automatic moc for target testarrayargument
      Generating moc_testarrayargument.cpp
      [ 27%] Built target testarrayargument_automoc
      Scanning dependencies of target testarrayargument
      [ 27%] Building CXX object ApiExtractor/tests/CMakeFiles/testarrayargument.dir/testarrayargument.cpp.o
      [ 28%] Building CXX object ApiExtractor/tests/CMakeFiles/testarrayargument.dir/testarrayargument_automoc.cpp.o
      [ 28%] Linking CXX executable testarrayargument
      [ 28%] Built target testarrayargument
      Scanning dependencies of target testdtorinformation_automoc
      [ 29%] Automatic moc for target testdtorinformation
      Generating moc_testdtorinformation.cpp
      [ 29%] Built target testdtorinformation_automoc
      Scanning dependencies of target testdtorinformation
      [ 30%] Building CXX object ApiExtractor/tests/CMakeFiles/testdtorinformation.dir/testdtorinformation.cpp.o
      [ 30%] Building CXX object ApiExtractor/tests/CMakeFiles/testdtorinformation.dir/testdtorinformation_automoc.cpp.o
      [ 30%] Linking CXX executable testdtorinformation
      [ 30%] Built target testdtorinformation
      Scanning dependencies of target testenum_automoc
      [ 31%] Automatic moc for target testenum
      Generating moc_testenum.cpp
      [ 31%] Built target testenum_automoc
      Scanning dependencies of target testenum
      [ 31%] Building CXX object ApiExtractor/tests/CMakeFiles/testenum.dir/testenum.cpp.o
      [ 31%] Building CXX object ApiExtractor/tests/CMakeFiles/testenum.dir/testenum_automoc.cpp.o
      [ 31%] Linking CXX executable testenum
      [ 31%] Built target testenum
      Scanning dependencies of target testmultipleinheritance_automoc
      [ 31%] Automatic moc for target testmultipleinheritance
      Generating moc_testmultipleinheritance.cpp
      [ 31%] Built target testmultipleinheritance_automoc
      Scanning dependencies of target testmultipleinheritance
      [ 31%] Building CXX object ApiExtractor/tests/CMakeFiles/testmultipleinheritance.dir/testmultipleinheritance.cpp.o
      [ 31%] Building CXX object ApiExtractor/tests/CMakeFiles/testmultipleinheritance.dir/testmultipleinheritance_automoc.cpp.o
      [ 32%] Linking CXX executable testmultipleinheritance
      [ 32%] Built target testmultipleinheritance
      Scanning dependencies of target testextrainclude_automoc
      [ 33%] Automatic moc for target testextrainclude
      Generating moc_testextrainclude.cpp
      [ 33%] Built target testextrainclude_automoc
      Scanning dependencies of target testextrainclude
      [ 33%] Building CXX object ApiExtractor/tests/CMakeFiles/testextrainclude.dir/testextrainclude.cpp.o
      [ 33%] Building CXX object ApiExtractor/tests/CMakeFiles/testextrainclude.dir/testextrainclude_automoc.cpp.o
      [ 33%] Linking CXX executable testextrainclude
      [ 33%] Built target testextrainclude
      Scanning dependencies of target testnamespace_automoc
      [ 33%] Automatic moc for target testnamespace
      Generating moc_testnamespace.cpp
      [ 33%] Built target testnamespace_automoc
      Scanning dependencies of target testnamespace
      [ 33%] Building CXX object ApiExtractor/tests/CMakeFiles/testnamespace.dir/testnamespace.cpp.o
      [ 33%] Building CXX object ApiExtractor/tests/CMakeFiles/testnamespace.dir/testnamespace_automoc.cpp.o
      [ 34%] Linking CXX executable testnamespace
      [ 34%] Built target testnamespace
      Scanning dependencies of target testcodeinjection_automoc
      [ 34%] Automatic moc for target testcodeinjection
      Generating moc_testcodeinjection.cpp
      [ 34%] Built target testcodeinjection_automoc
      Scanning dependencies of target testcodeinjection
      [ 34%] Building CXX object ApiExtractor/tests/CMakeFiles/testcodeinjection.dir/testcodeinjection.cpp.o
      [ 35%] Building CXX object ApiExtractor/tests/CMakeFiles/testcodeinjection.dir/testcodeinjection_automoc.cpp.o
      [ 35%] Linking CXX executable testcodeinjection
      [ 35%] Built target testcodeinjection
      Scanning dependencies of target testmodifyfunction_automoc
      [ 35%] Automatic moc for target testmodifyfunction
      Generating moc_testmodifyfunction.cpp
      [ 35%] Built target testmodifyfunction_automoc
      Scanning dependencies of target testmodifyfunction
      [ 35%] Building CXX object ApiExtractor/tests/CMakeFiles/testmodifyfunction.dir/testmodifyfunction.cpp.o
      [ 35%] Building CXX object ApiExtractor/tests/CMakeFiles/testmodifyfunction.dir/testmodifyfunction_automoc.cpp.o
      [ 36%] Linking CXX executable testmodifyfunction
      [ 36%] Built target testmodifyfunction
      Scanning dependencies of target testremovefield_automoc
      [ 36%] Automatic moc for target testremovefield
      Generating moc_testremovefield.cpp
      [ 36%] Built target testremovefield_automoc
      Scanning dependencies of target testremovefield
      [ 36%] Building CXX object ApiExtractor/tests/CMakeFiles/testremovefield.dir/testremovefield.cpp.o
      [ 37%] Building CXX object ApiExtractor/tests/CMakeFiles/testremovefield.dir/testremovefield_automoc.cpp.o
      [ 37%] Linking CXX executable testremovefield
      [ 37%] Built target testremovefield
      Scanning dependencies of target testfunctiontag_automoc
      [ 38%] Automatic moc for target testfunctiontag
      Generating moc_testfunctiontag.cpp
      [ 38%] Built target testfunctiontag_automoc
      Scanning dependencies of target testfunctiontag
      [ 38%] Building CXX object ApiExtractor/tests/CMakeFiles/testfunctiontag.dir/testfunctiontag.cpp.o
      [ 38%] Building CXX object ApiExtractor/tests/CMakeFiles/testfunctiontag.dir/testfunctiontag_automoc.cpp.o
      [ 38%] Linking CXX executable testfunctiontag
      [ 38%] Built target testfunctiontag
      Scanning dependencies of target testinserttemplate_automoc
      [ 39%] Automatic moc for target testinserttemplate
      Generating moc_testinserttemplate.cpp
      [ 39%] Built target testinserttemplate_automoc
      Scanning dependencies of target testinserttemplate
      [ 39%] Building CXX object ApiExtractor/tests/CMakeFiles/testinserttemplate.dir/testinserttemplate.cpp.o
      [ 39%] Building CXX object ApiExtractor/tests/CMakeFiles/testinserttemplate.dir/testinserttemplate_automoc.cpp.o
      [ 39%] Linking CXX executable testinserttemplate
      [ 39%] Built target testinserttemplate
      Scanning dependencies of target testnestedtypes_automoc
      [ 39%] Automatic moc for target testnestedtypes
      Generating moc_testnestedtypes.cpp
      [ 39%] Built target testnestedtypes_automoc
      Scanning dependencies of target testnestedtypes
      [ 39%] Building CXX object ApiExtractor/tests/CMakeFiles/testnestedtypes.dir/testnestedtypes.cpp.o
      [ 39%] Building CXX object ApiExtractor/tests/CMakeFiles/testnestedtypes.dir/testnestedtypes_automoc.cpp.o
      [ 40%] Linking CXX executable testnestedtypes
      [ 40%] Built target testnestedtypes
      Scanning dependencies of target testnumericaltypedef_automoc
      [ 40%] Automatic moc for target testnumericaltypedef
      Generating moc_testnumericaltypedef.cpp
      [ 40%] Built target testnumericaltypedef_automoc
      Scanning dependencies of target testnumericaltypedef
      [ 40%] Building CXX object ApiExtractor/tests/CMakeFiles/testnumericaltypedef.dir/testnumericaltypedef.cpp.o
      [ 40%] Building CXX object ApiExtractor/tests/CMakeFiles/testnumericaltypedef.dir/testnumericaltypedef_automoc.cpp.o
      [ 41%] Linking CXX executable testnumericaltypedef
      [ 41%] Built target testnumericaltypedef
      Scanning dependencies of target testprimitivetypetag_automoc
      [ 41%] Automatic moc for target testprimitivetypetag
      Generating moc_testprimitivetypetag.cpp
      [ 41%] Built target testprimitivetypetag_automoc
      Scanning dependencies of target testprimitivetypetag
      [ 41%] Building CXX object ApiExtractor/tests/CMakeFiles/testprimitivetypetag.dir/testprimitivetypetag.cpp.o
      [ 41%] Building CXX object ApiExtractor/tests/CMakeFiles/testprimitivetypetag.dir/testprimitivetypetag_automoc.cpp.o
      [ 42%] Linking CXX executable testprimitivetypetag
      [ 42%] Built target testprimitivetypetag
      Scanning dependencies of target libshiboken
      [ 42%] Building CXX object libshiboken/CMakeFiles/libshiboken.dir/basewrapper.cpp.o
      [ 42%] Building CXX object libshiboken/CMakeFiles/libshiboken.dir/debugfreehook.cpp.o
      [ 42%] Building CXX object libshiboken/CMakeFiles/libshiboken.dir/gilstate.cpp.o
      [ 43%] Building CXX object libshiboken/CMakeFiles/libshiboken.dir/helper.cpp.o
      [ 43%] Building CXX object libshiboken/CMakeFiles/libshiboken.dir/sbkconverter.cpp.o
      [ 43%] Building CXX object libshiboken/CMakeFiles/libshiboken.dir/sbkenum.cpp.o
      [ 43%] Building CXX object libshiboken/CMakeFiles/libshiboken.dir/sbkmodule.cpp.o
      [ 44%] Building CXX object libshiboken/CMakeFiles/libshiboken.dir/sbkstring.cpp.o
      [ 44%] Building CXX object libshiboken/CMakeFiles/libshiboken.dir/bindingmanager.cpp.o
      [ 44%] Building CXX object libshiboken/CMakeFiles/libshiboken.dir/threadstatesaver.cpp.o
      [ 44%] Building CXX object libshiboken/CMakeFiles/libshiboken.dir/typeresolver.cpp.o
      [ 45%] Building CXX object libshiboken/CMakeFiles/libshiboken.dir/shibokenbuffer.cpp.o
      [ 45%] Linking CXX shared library libshiboken2.x86_64-linux-gnu.so
      [ 45%] Built target libshiboken
      Scanning dependencies of target shiboken2
      [ 45%] Building CXX object generator/CMakeFiles/shiboken2.dir/generator.cpp.o
      [ 46%] Building CXX object generator/CMakeFiles/shiboken2.dir/shiboken2/cppgenerator.cpp.o
      [ 46%] Building CXX object generator/CMakeFiles/shiboken2.dir/shiboken2/headergenerator.cpp.o
      [ 46%] Building CXX object generator/CMakeFiles/shiboken2.dir/shiboken2/overloaddata.cpp.o
      [ 46%] Building CXX object generator/CMakeFiles/shiboken2.dir/shiboken2/shibokengenerator.cpp.o
      [ 47%] Building CXX object generator/CMakeFiles/shiboken2.dir/main.cpp.o
      [ 47%] Building CXX object generator/CMakeFiles/shiboken2.dir/qtdoc/qtdocgenerator.cpp.o
      [ 47%] Linking CXX executable shiboken2
      [ 47%] Built target shiboken2
      [ 47%] Running generator for 'shiboken2'...
      clang_parseTranslationUnit2(0x0, cmd[14]=-nostdinc -I/usr/include/c++/5 -I/usr/include/x86_64-linux-gnu/c++/5 -I/usr/include/c++/5/backward -I/usr/lib/gcc/x86_64-linux-gnu/5/include -I/usr/local/include -I/usr/lib/gcc/x86_64-linux-gnu/5/include-fixed -I/usr/include/x86_64-linux-gnu -I/usr/include -std=c++14 -fPIC -fno-exceptions -Wno-constant-logical-operand /tmp/nothing_J17840.hpp)
      Detecting inconsistencies in typesystem...   [OK]
      
      qt.shiboken: No C++ classes found!
      Done, 443ms, 1 warnings
      Scanning dependencies of target shibokenmodule
      [ 48%] Building CXX object shibokenmodule/CMakeFiles/shibokenmodule.dir/shiboken2/shiboken2_module_wrapper.cpp.o
      [ 48%] Linking CXX shared module shiboken2.so
      [ 48%] Built target shibokenmodule
      Scanning dependencies of target libminimal
      [ 48%] Building CXX object tests/libminimal/CMakeFiles/libminimal.dir/obj.cpp.o
      [ 48%] Building CXX object tests/libminimal/CMakeFiles/libminimal.dir/listuser.cpp.o
      [ 49%] Building CXX object tests/libminimal/CMakeFiles/libminimal.dir/typedef.cpp.o
      [ 49%] Linking CXX shared library libminimal.so
      [ 49%] Built target libminimal
      Scanning dependencies of target libsample
      [ 49%] Building CXX object tests/libsample/CMakeFiles/libsample.dir/abstract.cpp.o
      [ 50%] Building CXX object tests/libsample/CMakeFiles/libsample.dir/blackbox.cpp.o
      [ 50%] Building CXX object tests/libsample/CMakeFiles/libsample.dir/bytearray.cpp.o
      [ 50%] Building CXX object tests/libsample/CMakeFiles/libsample.dir/bucket.cpp.o
      [ 50%] Building CXX object tests/libsample/CMakeFiles/libsample.dir/collector.cpp.o
      [ 51%] Building CXX object tests/libsample/CMakeFiles/libsample.dir/complex.cpp.o
      [ 51%] Building CXX object tests/libsample/CMakeFiles/libsample.dir/onlycopy.cpp.o
      [ 51%] Building CXX object tests/libsample/CMakeFiles/libsample.dir/derived.cpp.o
      [ 51%] Building CXX object tests/libsample/CMakeFiles/libsample.dir/echo.cpp.o
      [ 52%] Building CXX object tests/libsample/CMakeFiles/libsample.dir/functions.cpp.o
      [ 52%] Building CXX object tests/libsample/CMakeFiles/libsample.dir/handle.cpp.o
      [ 52%] Building CXX object tests/libsample/CMakeFiles/libsample.dir/implicitconv.cpp.o
      [ 52%] Building CXX object tests/libsample/CMakeFiles/libsample.dir/injectcode.cpp.o
      [ 53%] Building CXX object tests/libsample/CMakeFiles/libsample.dir/listuser.cpp.o
      [ 53%] Building CXX object tests/libsample/CMakeFiles/libsample.dir/modifications.cpp.o
      [ 53%] Building CXX object tests/libsample/CMakeFiles/libsample.dir/mapuser.cpp.o
      [ 54%] Building CXX object tests/libsample/CMakeFiles/libsample.dir/modified_constructor.cpp.o
      [ 54%] Building CXX object tests/libsample/CMakeFiles/libsample.dir/multiple_derived.cpp.o
      [ 54%] Building CXX object tests/libsample/CMakeFiles/libsample.dir/objectmodel.cpp.o
      [ 54%] Building CXX object tests/libsample/CMakeFiles/libsample.dir/objecttype.cpp.o
      /home/filippo/tmp/pyside2/src/pyside-setup/sources/shiboken2/tests/libsample/objecttype.cpp: In member function ‘void ObjectType::callVirtualCreateChild()’:
      /home/filippo/tmp/pyside2/src/pyside-setup/sources/shiboken2/tests/libsample/objecttype.cpp:283:17: warning: unused variable ‘fake_child’ [-Wunused-variable]
           ObjectType* fake_child = createChild(fake_parent);
                       ^
      [ 55%] Building CXX object tests/libsample/CMakeFiles/libsample.dir/objecttypeholder.cpp.o
      [ 55%] Building CXX object tests/libsample/CMakeFiles/libsample.dir/objecttypelayout.cpp.o
      [ 55%] Building CXX object tests/libsample/CMakeFiles/libsample.dir/objecttypeoperators.cpp.o
      [ 55%] Building CXX object tests/libsample/CMakeFiles/libsample.dir/objectview.cpp.o
      [ 56%] Building CXX object tests/libsample/CMakeFiles/libsample.dir/overload.cpp.o
      [ 56%] Building CXX object tests/libsample/CMakeFiles/libsample.dir/overloadsort.cpp.o
      [ 56%] Building CXX object tests/libsample/CMakeFiles/libsample.dir/pairuser.cpp.o
      [ 56%] Building CXX object tests/libsample/CMakeFiles/libsample.dir/pen.cpp.o
      [ 57%] Building CXX object tests/libsample/CMakeFiles/libsample.dir/photon.cpp.o
      [ 57%] Building CXX object tests/libsample/CMakeFiles/libsample.dir/point.cpp.o
      [ 57%] Building CXX object tests/libsample/CMakeFiles/libsample.dir/pointf.cpp.o
      [ 57%] Building CXX object tests/libsample/CMakeFiles/libsample.dir/polygon.cpp.o
      [ 58%] Building CXX object tests/libsample/CMakeFiles/libsample.dir/protected.cpp.o
      [ 58%] Building CXX object tests/libsample/CMakeFiles/libsample.dir/reference.cpp.o
      [ 58%] Building CXX object tests/libsample/CMakeFiles/libsample.dir/sample.cpp.o
      [ 58%] Building CXX object tests/libsample/CMakeFiles/libsample.dir/samplenamespace.cpp.o
      [ 59%] Building CXX object tests/libsample/CMakeFiles/libsample.dir/sbkdate.cpp.o
      [ 59%] Building CXX object tests/libsample/CMakeFiles/libsample.dir/simplefile.cpp.o
      [ 59%] Building CXX object tests/libsample/CMakeFiles/libsample.dir/size.cpp.o
      [ 60%] Building CXX object tests/libsample/CMakeFiles/libsample.dir/sometime.cpp.o
      [ 60%] Building CXX object tests/libsample/CMakeFiles/libsample.dir/str.cpp.o
      [ 60%] Building CXX object tests/libsample/CMakeFiles/libsample.dir/strlist.cpp.o
      [ 60%] Building CXX object tests/libsample/CMakeFiles/libsample.dir/templateptr.cpp.o
      [ 61%] Building CXX object tests/libsample/CMakeFiles/libsample.dir/transform.cpp.o
      [ 61%] Building CXX object tests/libsample/CMakeFiles/libsample.dir/virtualmethods.cpp.o
      [ 61%] Building CXX object tests/libsample/CMakeFiles/libsample.dir/expression.cpp.o
      [ 61%] Building CXX object tests/libsample/CMakeFiles/libsample.dir/filter.cpp.o
      [ 62%] Linking CXX shared library libsample.so
      [ 62%] Built target libsample
      Scanning dependencies of target libsmart
      [ 62%] Building CXX object tests/libsmart/CMakeFiles/libsmart.dir/smart.cpp.o
      [ 63%] Linking CXX shared library libsmart.so
      [ 63%] Built target libsmart
      Scanning dependencies of target libother
      [ 63%] Building CXX object tests/libother/CMakeFiles/libother.dir/number.cpp.o
      [ 63%] Building CXX object tests/libother/CMakeFiles/libother.dir/otherderived.cpp.o
      [ 64%] Building CXX object tests/libother/CMakeFiles/libother.dir/otherobjecttype.cpp.o
      [ 64%] Building CXX object tests/libother/CMakeFiles/libother.dir/othermultiplederived.cpp.o
      [ 64%] Linking CXX shared library libother.so
      [ 64%] Built target libother
      [ 64%] Running generator for 'minimal' test binding...
      clang_parseTranslationUnit2(0x0, cmd[15]=-nostdinc -I/usr/include/c++/5 -I/usr/include/x86_64-linux-gnu/c++/5 -I/usr/include/c++/5/backward -I/usr/lib/gcc/x86_64-linux-gnu/5/include -I/usr/local/include -I/usr/lib/gcc/x86_64-linux-gnu/5/include-fixed -I/usr/include/x86_64-linux-gnu -I/usr/include -std=c++14 -fPIC -fno-exceptions -Wno-constant-logical-operand -I/home/filippo/tmp/pyside2/src/pyside-setup/sources/shiboken2/tests/libminimal /tmp/global_J18337.hpp)
      Generating class model...                    [OK]
      Resolving typedefs...                        [OK]
      Fixing class inheritance...                  [OK]
      Detecting inconsistencies in class model...  [OK]
      [OK]
      
      Done, 229ms
      Scanning dependencies of target minimal
      [ 64%] Building CXX object tests/minimalbinding/CMakeFiles/minimal.dir/minimal/minimal_module_wrapper.cpp.o
      [ 64%] Building CXX object tests/minimalbinding/CMakeFiles/minimal.dir/minimal/obj_wrapper.cpp.o
      [ 65%] Building CXX object tests/minimalbinding/CMakeFiles/minimal.dir/minimal/val_wrapper.cpp.o
      [ 65%] Building CXX object tests/minimalbinding/CMakeFiles/minimal.dir/minimal/listuser_wrapper.cpp.o
      [ 65%] Building CXX object tests/minimalbinding/CMakeFiles/minimal.dir/minimal/minbooluser_wrapper.cpp.o
      [ 65%] Linking CXX shared module minimal.so
      [ 65%] Built target minimal
      [ 66%] Running generator for 'sample' test binding...
      clang_parseTranslationUnit2(0x0, cmd[15]=-nostdinc -I/usr/include/c++/5 -I/usr/include/x86_64-linux-gnu/c++/5 -I/usr/include/c++/5/backward -I/usr/lib/gcc/x86_64-linux-gnu/5/include -I/usr/local/include -I/usr/lib/gcc/x86_64-linux-gnu/5/include-fixed -I/usr/include/x86_64-linux-gnu -I/usr/include -std=c++14 -fPIC -fno-exceptions -Wno-constant-logical-operand -I/home/filippo/tmp/pyside2/src/pyside-setup/sources/shiboken2/tests/libsample /tmp/global_J18389.hpp)
      Generating class model...                    qt.shiboken: enum 'Expression::Operation' does not have a type entry or is not an enum
      [WARNING]
      Generating enum model...                     [OK]
      Generating namespace model...                qt.shiboken: namespace 'Foo' does not have a type entry
      [WARNING]
      Resolving typedefs...                        [OK]
      Fixing class inheritance...                  [OK]
      Detecting inconsistencies in class model...  qt.shiboken: hiding of function 'takeChild' in class 'ObjectTypeDerived'
      [WARNING]
      [OK]
      qt.shiboken: enum 'SampleNamespace::DerivedFromNamespace::SampleNamespace' is specified in typesystem, but not declared
      
      qt.shiboken: Pure virtual method 'Abstract::hideFunction(HideType*)' must be implement but was completely removed on type system.
      Done, 340ms, 5 warnings (15 known issues)
      Scanning dependencies of target sample
      [ 66%] Building CXX object tests/samplebinding/CMakeFiles/sample.dir/sample/abstractmodifications_wrapper.cpp.o
      [ 66%] Building CXX object tests/samplebinding/CMakeFiles/sample.dir/sample/abstract_wrapper.cpp.o
      [ 66%] Building CXX object tests/samplebinding/CMakeFiles/sample.dir/sample/base1_wrapper.cpp.o
      [ 67%] Building CXX object tests/samplebinding/CMakeFiles/sample.dir/sample/base2_wrapper.cpp.o
      [ 67%] Building CXX object tests/samplebinding/CMakeFiles/sample.dir/sample/base3_wrapper.cpp.o
      [ 67%] Building CXX object tests/samplebinding/CMakeFiles/sample.dir/sample/base4_wrapper.cpp.o
      [ 67%] Building CXX object tests/samplebinding/CMakeFiles/sample.dir/sample/base5_wrapper.cpp.o
      [ 68%] Building CXX object tests/samplebinding/CMakeFiles/sample.dir/sample/base6_wrapper.cpp.o
      [ 68%] Building CXX object tests/samplebinding/CMakeFiles/sample.dir/sample/blackbox_wrapper.cpp.o
      [ 68%] Building CXX object tests/samplebinding/CMakeFiles/sample.dir/sample/bytearray_wrapper.cpp.o
      [ 69%] Building CXX object tests/samplebinding/CMakeFiles/sample.dir/sample/bucket_wrapper.cpp.o
      [ 69%] Building CXX object tests/samplebinding/CMakeFiles/sample.dir/sample/classwithfunctionpointer_wrapper.cpp.o
      [ 69%] Building CXX object tests/samplebinding/CMakeFiles/sample.dir/sample/collector_wrapper.cpp.o
      [ 69%] Building CXX object tests/samplebinding/CMakeFiles/sample.dir/sample/color_wrapper.cpp.o
      [ 70%] Building CXX object tests/samplebinding/CMakeFiles/sample.dir/sample/ctorconvrule_wrapper.cpp.o
      [ 70%] Building CXX object tests/samplebinding/CMakeFiles/sample.dir/sample/cvlistuser_wrapper.cpp.o
      [ 70%] Building CXX object tests/samplebinding/CMakeFiles/sample.dir/sample/cvvaluetype_wrapper.cpp.o
      [ 70%] Building CXX object tests/samplebinding/CMakeFiles/sample.dir/sample/sbkdate_wrapper.cpp.o
      [ 71%] Building CXX object tests/samplebinding/CMakeFiles/sample.dir/sample/derived_wrapper.cpp.o
      [ 71%] Building CXX object tests/samplebinding/CMakeFiles/sample.dir/sample/derived_someinnerclass_wrapper.cpp.o
      [ 71%] Building CXX object tests/samplebinding/CMakeFiles/sample.dir/sample/echo_wrapper.cpp.o
      [ 71%] Building CXX object tests/samplebinding/CMakeFiles/sample.dir/sample/event_wrapper.cpp.o
      [ 72%] Building CXX object tests/samplebinding/CMakeFiles/sample.dir/sample/expression_wrapper.cpp.o
      [ 72%] Building CXX object tests/samplebinding/CMakeFiles/sample.dir/sample/friendofonlycopy_wrapper.cpp.o
      [ 72%] Building CXX object tests/samplebinding/CMakeFiles/sample.dir/sample/handleholder_wrapper.cpp.o
      [ 72%] Building CXX object tests/samplebinding/CMakeFiles/sample.dir/sample/implicitconv_wrapper.cpp.o
      [ 73%] Building CXX object tests/samplebinding/CMakeFiles/sample.dir/sample/implicitbase_wrapper.cpp.o
      [ 73%] Building CXX object tests/samplebinding/CMakeFiles/sample.dir/sample/implicittarget_wrapper.cpp.o
      [ 73%] Building CXX object tests/samplebinding/CMakeFiles/sample.dir/sample/intlist_wrapper.cpp.o
      [ 73%] Building CXX object tests/samplebinding/CMakeFiles/sample.dir/sample/sortedoverload_wrapper.cpp.o
      [ 74%] Building CXX object tests/samplebinding/CMakeFiles/sample.dir/sample/intwrapper_wrapper.cpp.o
      [ 74%] Building CXX object tests/samplebinding/CMakeFiles/sample.dir/sample/injectcode_wrapper.cpp.o
      [ 74%] Building CXX object tests/samplebinding/CMakeFiles/sample.dir/sample/listuser_wrapper.cpp.o
      [ 75%] Building CXX object tests/samplebinding/CMakeFiles/sample.dir/sample/mapuser_wrapper.cpp.o
      [ 75%] Building CXX object tests/samplebinding/CMakeFiles/sample.dir/sample/mderived1_wrapper.cpp.o
      [ 75%] Building CXX object tests/samplebinding/CMakeFiles/sample.dir/sample/mderived2_wrapper.cpp.o
      [ 75%] Building CXX object tests/samplebinding/CMakeFiles/sample.dir/sample/mderived3_wrapper.cpp.o
      [ 76%] Building CXX object tests/samplebinding/CMakeFiles/sample.dir/sample/mderived4_wrapper.cpp.o
      [ 76%] Building CXX object tests/samplebinding/CMakeFiles/sample.dir/sample/mderived5_wrapper.cpp.o
      [ 76%] Building CXX object tests/samplebinding/CMakeFiles/sample.dir/sample/modelindex_wrapper.cpp.o
      [ 76%] Building CXX object tests/samplebinding/CMakeFiles/sample.dir/sample/modifications_wrapper.cpp.o
      [ 77%] Building CXX object tests/samplebinding/CMakeFiles/sample.dir/sample/modifiedconstructor_wrapper.cpp.o
      [ 77%] Building CXX object tests/samplebinding/CMakeFiles/sample.dir/sample/noimplicitconversion_wrapper.cpp.o
      [ 77%] Building CXX object tests/samplebinding/CMakeFiles/sample.dir/sample/nondefaultctor_wrapper.cpp.o
      [ 77%] Building CXX object tests/samplebinding/CMakeFiles/sample.dir/sample/objectmodel_wrapper.cpp.o
      [ 78%] Building CXX object tests/samplebinding/CMakeFiles/sample.dir/sample/objecttype_wrapper.cpp.o
      [ 78%] Building CXX object tests/samplebinding/CMakeFiles/sample.dir/sample/objecttypebyvalue_wrapper.cpp.o
      [ 78%] Building CXX object tests/samplebinding/CMakeFiles/sample.dir/sample/objecttypeholder_wrapper.cpp.o
      [ 78%] Building CXX object tests/samplebinding/CMakeFiles/sample.dir/sample/objecttypederived_wrapper.cpp.o
      [ 79%] Building CXX object tests/samplebinding/CMakeFiles/sample.dir/sample/objecttypelayout_wrapper.cpp.o
      [ 79%] Building CXX object tests/samplebinding/CMakeFiles/sample.dir/sample/objecttypeptrlist_wrapper.cpp.o
      [ 79%] Building CXX object tests/samplebinding/CMakeFiles/sample.dir/sample/objecttypeoperators_wrapper.cpp.o
      [ 79%] Building CXX object tests/samplebinding/CMakeFiles/sample.dir/sample/objectview_wrapper.cpp.o
      [ 80%] Building CXX object tests/samplebinding/CMakeFiles/sample.dir/sample/objtypereference_wrapper.cpp.o
      [ 80%] Building CXX object tests/samplebinding/CMakeFiles/sample.dir/sample/oddbooluser_wrapper.cpp.o
      [ 80%] Building CXX object tests/samplebinding/CMakeFiles/sample.dir/sample/onlycopy_wrapper.cpp.o
      [ 81%] Building CXX object tests/samplebinding/CMakeFiles/sample.dir/sample/otherbase_wrapper.cpp.o
      [ 81%] Building CXX object tests/samplebinding/CMakeFiles/sample.dir/sample/overload_wrapper.cpp.o
      [ 81%] Building CXX object tests/samplebinding/CMakeFiles/sample.dir/sample/overload2_wrapper.cpp.o
      [ 81%] Building CXX object tests/samplebinding/CMakeFiles/sample.dir/sample/pairuser_wrapper.cpp.o
      [ 82%] Building CXX object tests/samplebinding/CMakeFiles/sample.dir/sample/pen_wrapper.cpp.o
      [ 82%] Building CXX object tests/samplebinding/CMakeFiles/sample.dir/sample/persistentmodelindex_wrapper.cpp.o
      [ 82%] Building CXX object tests/samplebinding/CMakeFiles/sample.dir/sample/photon_wrapper.cpp.o
      [ 82%] Building CXX object tests/samplebinding/CMakeFiles/sample.dir/sample/photon_base_wrapper.cpp.o
      [ 83%] Building CXX object tests/samplebinding/CMakeFiles/sample.dir/sample/photon_valueidentity_wrapper.cpp.o
      [ 83%] Building CXX object tests/samplebinding/CMakeFiles/sample.dir/sample/photon_valueduplicator_wrapper.cpp.o
      [ 83%] Building CXX object tests/samplebinding/CMakeFiles/sample.dir/sample/point_wrapper.cpp.o
      [ 83%] Building CXX object tests/samplebinding/CMakeFiles/sample.dir/sample/pointerholder_wrapper.cpp.o
      [ 84%] Building CXX object tests/samplebinding/CMakeFiles/sample.dir/sample/pointf_wrapper.cpp.o
      [ 84%] Building CXX object tests/samplebinding/CMakeFiles/sample.dir/sample/pointvaluelist_wrapper.cpp.o
      [ 84%] Building CXX object tests/samplebinding/CMakeFiles/sample.dir/sample/polygon_wrapper.cpp.o
      [ 84%] Building CXX object tests/samplebinding/CMakeFiles/sample.dir/sample/primitivestructpointerholder_wrapper.cpp.o
      [ 85%] Building CXX object tests/samplebinding/CMakeFiles/sample.dir/sample/privatector_wrapper.cpp.o
      [ 85%] Building CXX object tests/samplebinding/CMakeFiles/sample.dir/sample/privatedtor_wrapper.cpp.o
      [ 85%] Building CXX object tests/samplebinding/CMakeFiles/sample.dir/sample/protectedenumclass_wrapper.cpp.o
      [ 85%] Building CXX object tests/samplebinding/CMakeFiles/sample.dir/sample/protectednonpolymorphic_wrapper.cpp.o
      [ 86%] Building CXX object tests/samplebinding/CMakeFiles/sample.dir/sample/protectedpolymorphic_wrapper.cpp.o
      [ 86%] Building CXX object tests/samplebinding/CMakeFiles/sample.dir/sample/protectedpolymorphicdaughter_wrapper.cpp.o
      [ 86%] Building CXX object tests/samplebinding/CMakeFiles/sample.dir/sample/protectedpolymorphicgranddaughter_wrapper.cpp.o
      [ 87%] Building CXX object tests/samplebinding/CMakeFiles/sample.dir/sample/protectedproperty_wrapper.cpp.o
      [ 87%] Building CXX object tests/samplebinding/CMakeFiles/sample.dir/sample/protectedvirtualdestructor_wrapper.cpp.o
      [ 87%] Building CXX object tests/samplebinding/CMakeFiles/sample.dir/sample/rect_wrapper.cpp.o
      [ 87%] Building CXX object tests/samplebinding/CMakeFiles/sample.dir/sample/rectf_wrapper.cpp.o
      [ 88%] Building CXX object tests/samplebinding/CMakeFiles/sample.dir/sample/reference_wrapper.cpp.o
      [ 88%] Building CXX object tests/samplebinding/CMakeFiles/sample.dir/sample/referentmodelindex_wrapper.cpp.o
      [ 88%] Building CXX object tests/samplebinding/CMakeFiles/sample.dir/sample/sample_module_wrapper.cpp.o
      [ 88%] Building CXX object tests/samplebinding/CMakeFiles/sample.dir/sample/sample_wrapper.cpp.o
      [ 89%] Building CXX object tests/samplebinding/CMakeFiles/sample.dir/sample/sample_sample_wrapper.cpp.o
      [ 89%] Building CXX object tests/samplebinding/CMakeFiles/sample.dir/sample/samplenamespace_wrapper.cpp.o
      [ 89%] Building CXX object tests/samplebinding/CMakeFiles/sample.dir/sample/samplenamespace_someclass_someinnerclass_okthisisrecursiveenough_wrapper.cpp.o
      [ 89%] Building CXX object tests/samplebinding/CMakeFiles/sample.dir/sample/samplenamespace_someclass_someinnerclass_wrapper.cpp.o
      [ 90%] Building CXX object tests/samplebinding/CMakeFiles/sample.dir/sample/samplenamespace_someclass_someotherinnerclass_wrapper.cpp.o
      [ 90%] Building CXX object tests/samplebinding/CMakeFiles/sample.dir/sample/samplenamespace_someclass_wrapper.cpp.o
      [ 90%] Building CXX object tests/samplebinding/CMakeFiles/sample.dir/sample/samplenamespace_derivedfromnamespace_wrapper.cpp.o
      [ 90%] Building CXX object tests/samplebinding/CMakeFiles/sample.dir/sample/simplefile_wrapper.cpp.o
      [ 91%] Building CXX object tests/samplebinding/CMakeFiles/sample.dir/sample/size_wrapper.cpp.o
      [ 91%] Building CXX object tests/samplebinding/CMakeFiles/sample.dir/sample/sizef_wrapper.cpp.o
      [ 91%] Building CXX object tests/samplebinding/CMakeFiles/sample.dir/sample/sonofmderived1_wrapper.cpp.o
      [ 91%] Building CXX object tests/samplebinding/CMakeFiles/sample.dir/sample/str_wrapper.cpp.o
      [ 92%] Building CXX object tests/samplebinding/CMakeFiles/sample.dir/sample/strlist_wrapper.cpp.o
      [ 92%] Building CXX object tests/samplebinding/CMakeFiles/sample.dir/sample/time_wrapper.cpp.o
      [ 92%] Building CXX object tests/samplebinding/CMakeFiles/sample.dir/sample/templateptr_wrapper.cpp.o
      [ 92%] Building CXX object tests/samplebinding/CMakeFiles/sample.dir/sample/unremovednamespace_wrapper.cpp.o
      [ 93%] Building CXX object tests/samplebinding/CMakeFiles/sample.dir/sample/virtualdaughter_wrapper.cpp.o
      [ 93%] Building CXX object tests/samplebinding/CMakeFiles/sample.dir/sample/virtualdtor_wrapper.cpp.o
      [ 93%] Building CXX object tests/samplebinding/CMakeFiles/sample.dir/sample/virtualmethods_wrapper.cpp.o
      [ 94%] Building CXX object tests/samplebinding/CMakeFiles/sample.dir/sample/voidholder_wrapper.cpp.o
      [ 94%] Building CXX object tests/samplebinding/CMakeFiles/sample.dir/sample/valueandvirtual_wrapper.cpp.o
      [ 94%] Building CXX object tests/samplebinding/CMakeFiles/sample.dir/sample/filter_wrapper.cpp.o
      [ 94%] Building CXX object tests/samplebinding/CMakeFiles/sample.dir/sample/data_wrapper.cpp.o
      [ 95%] Building CXX object tests/samplebinding/CMakeFiles/sample.dir/sample/intersection_wrapper.cpp.o
      [ 95%] Building CXX object tests/samplebinding/CMakeFiles/sample.dir/sample/union_wrapper.cpp.o
      [ 95%] Linking CXX shared module sample.so
      [ 95%] Built target sample
      [ 95%] Running generator for 'smart' test binding...
      clang_parseTranslationUnit2(0x0, cmd[15]=-nostdinc -I/usr/include/c++/5 -I/usr/include/x86_64-linux-gnu/c++/5 -I/usr/include/c++/5/backward -I/usr/lib/gcc/x86_64-linux-gnu/5/include -I/usr/local/include -I/usr/lib/gcc/x86_64-linux-gnu/5/include-fixed -I/usr/include/x86_64-linux-gnu -I/usr/include -std=c++14 -fPIC -fno-exceptions -Wno-constant-logical-operand -I/home/filippo/tmp/pyside2/src/pyside-setup/sources/shiboken2/tests/libsmart /tmp/global_J19215.hpp)
      Generating class model...                    [OK]
      Fixing class inheritance...                  [OK]
      Detecting inconsistencies in class model...  [OK]
      [OK]
      
      Done, 210ms
      Scanning dependencies of target smart
      [ 95%] Building CXX object tests/smartbinding/CMakeFiles/smart.dir/smart/smart_module_wrapper.cpp.o
      [ 96%] Building CXX object tests/smartbinding/CMakeFiles/smart.dir/smart/obj_wrapper.cpp.o
      [ 96%] Building CXX object tests/smartbinding/CMakeFiles/smart.dir/smart/integer_wrapper.cpp.o
      [ 96%] Building CXX object tests/smartbinding/CMakeFiles/smart.dir/smart/sharedptr_obj_wrapper.cpp.o
      [ 97%] Building CXX object tests/smartbinding/CMakeFiles/smart.dir/smart/sharedptr_integer_wrapper.cpp.o
      [ 97%] Building CXX object tests/smartbinding/CMakeFiles/smart.dir/smart/registry_wrapper.cpp.o
      [ 97%] Linking CXX shared module smart.so
      [ 97%] Built target smart
      [ 98%] Running generator for 'other' test binding...
      clang_parseTranslationUnit2(0x0, cmd[17]=-nostdinc -I/usr/include/c++/5 -I/usr/include/x86_64-linux-gnu/c++/5 -I/usr/include/c++/5/backward -I/usr/lib/gcc/x86_64-linux-gnu/5/include -I/usr/local/include -I/usr/lib/gcc/x86_64-linux-gnu/5/include-fixed -I/usr/include/x86_64-linux-gnu -I/usr/include -std=c++14 -fPIC -fno-exceptions -Wno-constant-logical-operand -I/home/filippo/tmp/pyside2/src/pyside-setup/sources/shiboken2/tests/libother -I/home/filippo/tmp/pyside2/src/pyside-setup/sources/shiboken2/tests/libsample -I/home/filippo/tmp/pyside2/src/pyside-setup/sources/shiboken2/tests/libsample/.. /tmp/global_J19272.hpp)
      Generating class model...                    qt.shiboken: enum 'Expression::Operation' does not have a type entry or is not an enum
      [WARNING]
      Generating enum model...                     [OK]
      Generating namespace model...                qt.shiboken: namespace 'Foo' does not have a type entry
      [WARNING]
      Resolving typedefs...                        [OK]
      Fixing class inheritance...                  [OK]
      Detecting inconsistencies in class model...  qt.shiboken: hiding of function 'takeChild' in class 'ObjectTypeDerived'
      qt.shiboken: hiding of function 'takeChild' in class 'OtherObjectType'
      [WARNING]
      [OK]
      qt.shiboken: enum 'SampleNamespace::DerivedFromNamespace::SampleNamespace' is specified in typesystem, but not declared
      
      Done, 155ms, 5 warnings (18 known issues)
      Scanning dependencies of target other
      [ 98%] Building CXX object tests/otherbinding/CMakeFiles/other.dir/other/extendsnoimplicitconversion_wrapper.cpp.o
      [ 98%] Building CXX object tests/otherbinding/CMakeFiles/other.dir/other/number_wrapper.cpp.o
      [ 98%] Building CXX object tests/otherbinding/CMakeFiles/other.dir/other/otherderived_wrapper.cpp.o
      [ 99%] Building CXX object tests/otherbinding/CMakeFiles/other.dir/other/othermultiplederived_wrapper.cpp.o
      [ 99%] Building CXX object tests/otherbinding/CMakeFiles/other.dir/other/otherobjecttype_wrapper.cpp.o
      [ 99%] Building CXX object tests/otherbinding/CMakeFiles/other.dir/other/other_module_wrapper.cpp.o
      [ 99%] Linking CXX shared module other.so
      [ 99%] Built target other
      Scanning dependencies of target dumpcodemodel
      [ 99%] Building CXX object tests/dumpcodemodel/CMakeFiles/dumpcodemodel.dir/main.cpp.o
      [100%] Linking CXX executable dumpcodemodel
      [100%] Built target dumpcodemodel
      Generating Shiboken documentation shiboken2...
      Running process in /home/filippo/tmp/pyside2/src/pyside-setup/pyside22_build/py2.7-qt5.8.0-64bit-release/shiboken2: /usr/bin/make doc
      /usr/bin/make doc
      Scanning dependencies of target doc
      Running Sphinx v1.5.5
      making output directory...
      WARNING: The config value `html_add_permalinks' has type `bool', defaults to `unicode'.
      loading pickled environment... not yet created
      building [mo]: targets for 0 po files that are out of date
      building [html]: targets for 12 source files that are out of date
      updating environment: 12 added, 0 changed, 0 removed
      reading sources... [100%] wordsofadvice                                                                                                                                                  
      looking for now-outdated files... none found
      pickling environment... done
      checking consistency... done
      preparing documents... done
      writing output... [100%] wordsofadvice                                                                                                                                                   
      generating indices...
      writing additional pages... index search
      copying images... [100%] images/converter.png                                                                                                                                            
      copying static files... done
      copying extra files... done
      dumping search index in English (code: en) ... done
      dumping object inventory... done
      build succeeded, 1 warning.
      Built target doc
      Installing module shiboken2...
      Running process in /home/filippo/tmp/pyside2/src/pyside-setup/pyside22_build/py2.7-qt5.8.0-64bit-release/shiboken2: /usr/bin/make install/fast
      /usr/bin/make install/fast
      Install the project...
      -- Install configuration: "Release"
      -- Installing: /home/filippo/tmp/pyside2/src/pyside-setup/pyside22_install/py2.7-qt5.8.0-64bit-release/include/shiboken2/autodecref.h
      -- Installing: /home/filippo/tmp/pyside2/src/pyside-setup/pyside22_install/py2.7-qt5.8.0-64bit-release/include/shiboken2/basewrapper.h
      -- Installing: /home/filippo/tmp/pyside2/src/pyside-setup/pyside22_install/py2.7-qt5.8.0-64bit-release/include/shiboken2/bindingmanager.h
      -- Installing: /home/filippo/tmp/pyside2/src/pyside-setup/pyside22_install/py2.7-qt5.8.0-64bit-release/include/shiboken2/conversions.h
      -- Installing: /home/filippo/tmp/pyside2/src/pyside-setup/pyside22_install/py2.7-qt5.8.0-64bit-release/include/shiboken2/gilstate.h
      -- Installing: /home/filippo/tmp/pyside2/src/pyside-setup/pyside22_install/py2.7-qt5.8.0-64bit-release/include/shiboken2/helper.h
      -- Installing: /home/filippo/tmp/pyside2/src/pyside-setup/pyside22_install/py2.7-qt5.8.0-64bit-release/include/shiboken2/sbkconverter.h
      -- Installing: /home/filippo/tmp/pyside2/src/pyside-setup/pyside22_install/py2.7-qt5.8.0-64bit-release/include/shiboken2/sbkenum.h
      -- Installing: /home/filippo/tmp/pyside2/src/pyside-setup/pyside22_install/py2.7-qt5.8.0-64bit-release/include/shiboken2/sbkmodule.h
      -- Installing: /home/filippo/tmp/pyside2/src/pyside-setup/pyside22_install/py2.7-qt5.8.0-64bit-release/include/shiboken2/python25compat.h
      -- Installing: /home/filippo/tmp/pyside2/src/pyside-setup/pyside22_install/py2.7-qt5.8.0-64bit-release/include/shiboken2/sbkdbg.h
      -- Installing: /home/filippo/tmp/pyside2/src/pyside-setup/pyside22_install/py2.7-qt5.8.0-64bit-release/include/shiboken2/sbkstring.h
      -- Installing: /home/filippo/tmp/pyside2/src/pyside-setup/pyside22_install/py2.7-qt5.8.0-64bit-release/include/shiboken2/shiboken.h
      -- Installing: /home/filippo/tmp/pyside2/src/pyside-setup/pyside22_install/py2.7-qt5.8.0-64bit-release/include/shiboken2/shibokenmacros.h
      -- Installing: /home/filippo/tmp/pyside2/src/pyside-setup/pyside22_install/py2.7-qt5.8.0-64bit-release/include/shiboken2/threadstatesaver.h
      -- Installing: /home/filippo/tmp/pyside2/src/pyside-setup/pyside22_install/py2.7-qt5.8.0-64bit-release/include/shiboken2/typeresolver.h
      -- Installing: /home/filippo/tmp/pyside2/src/pyside-setup/pyside22_install/py2.7-qt5.8.0-64bit-release/include/shiboken2/shibokenbuffer.h
      -- Installing: /home/filippo/tmp/pyside2/src/pyside-setup/pyside22_install/py2.7-qt5.8.0-64bit-release/include/shiboken2/sbkpython.h
      -- Installing: /home/filippo/tmp/pyside2/src/pyside-setup/pyside22_install/py2.7-qt5.8.0-64bit-release/include/shiboken2/sbkversion.h
      -- Installing: /home/filippo/tmp/pyside2/src/pyside-setup/pyside22_install/py2.7-qt5.8.0-64bit-release/lib/libshiboken2.x86_64-linux-gnu.so.2.0.0
      -- Installing: /home/filippo/tmp/pyside2/src/pyside-setup/pyside22_install/py2.7-qt5.8.0-64bit-release/lib/libshiboken2.x86_64-linux-gnu.so.2.0
      -- Installing: /home/filippo/tmp/pyside2/src/pyside-setup/pyside22_install/py2.7-qt5.8.0-64bit-release/lib/libshiboken2.x86_64-linux-gnu.so
      -- Installing: /home/filippo/tmp/pyside2/src/pyside-setup/pyside22_install/py2.7-qt5.8.0-64bit-release/share/man/man1/shiboken2.1
      -- Installing: /home/filippo/tmp/pyside2/src/pyside-setup/pyside22_install/py2.7-qt5.8.0-64bit-release/bin/shiboken2
      -- Set runtime path of "/home/filippo/tmp/pyside2/src/pyside-setup/pyside22_install/py2.7-qt5.8.0-64bit-release/bin/shiboken2" to "/home/filippo/Qt/5.8/gcc_64/lib:/home/filippo/tmp/pyside2/tmp/libclang/lib"
      -- Installing: /home/filippo/tmp/pyside2/src/pyside-setup/pyside22_install/py2.7-qt5.8.0-64bit-release/lib/python2.7/site-packages/shiboken2.so
      -- Set runtime path of "/home/filippo/tmp/pyside2/src/pyside-setup/pyside22_install/py2.7-qt5.8.0-64bit-release/lib/python2.7/site-packages/shiboken2.so" to ""
      -- Installing: /home/filippo/tmp/pyside2/src/pyside-setup/pyside22_install/py2.7-qt5.8.0-64bit-release/lib/cmake/Shiboken2-2.0.0/Shiboken2Config.cmake
      -- Installing: /home/filippo/tmp/pyside2/src/pyside-setup/pyside22_install/py2.7-qt5.8.0-64bit-release/lib/cmake/Shiboken2-2.0.0/Shiboken2Config.x86_64-linux-gnu.cmake
      -- Installing: /home/filippo/tmp/pyside2/src/pyside-setup/pyside22_install/py2.7-qt5.8.0-64bit-release/lib/cmake/Shiboken2-2.0.0/Shiboken2ConfigVersion.cmake
      -- Installing: /home/filippo/tmp/pyside2/src/pyside-setup/pyside22_install/py2.7-qt5.8.0-64bit-release/lib/pkgconfig/shiboken2.pc
      Building module pyside2...
      Creating module build folder /home/filippo/tmp/pyside2/src/pyside-setup/pyside22_build/py2.7-qt5.8.0-64bit-release/pyside2...
      Configuring module pyside2 (/home/filippo/tmp/pyside2/src/pyside-setup/sources/pyside2)...
      Running process in /home/filippo/tmp/pyside2/src/pyside-setup/pyside22_build/py2.7-qt5.8.0-64bit-release/pyside2: /usr/bin/cmake -G "Unix Makefiles" -DQT_QMAKE_EXECUTABLE='/home/filippo/Qt/5.8/gcc_64/bin/qmake' -DBUILD_TESTS=True -DQt5Help_DIR=/home/filippo/Qt/Docs/Qt-5.8 -DCMAKE_BUILD_TYPE=Release -DCMAKE_INSTALL_PREFIX=/home/filippo/tmp/pyside2/src/pyside-setup/pyside22_install/py2.7-qt5.8.0-64bit-release /home/filippo/tmp/pyside2/src/pyside-setup/sources/pyside2 -DPYTHON_EXECUTABLE=/home/filippo/tmp/pyside2/bin/python -DPYTHON_INCLUDE_DIR=/usr/include/python2.7 -DPYTHON_LIBRARY=/usr/lib/x86_64-linux-gnu/libpython2.7.so -DQT_SRC_DIR=/home/filippo/Qt/5.8/gcc_64
      /usr/bin/cmake -G Unix Makefiles -DQT_QMAKE_EXECUTABLE='/home/filippo/Qt/5.8/gcc_64/bin/qmake' -DBUILD_TESTS=True -DQt5Help_DIR=/home/filippo/Qt/Docs/Qt-5.8 -DCMAKE_BUILD_TYPE=Release -DCMAKE_INSTALL_PREFIX=/home/filippo/tmp/pyside2/src/pyside-setup/pyside22_install/py2.7-qt5.8.0-64bit-release /home/filippo/tmp/pyside2/src/pyside-setup/sources/pyside2 -DPYTHON_EXECUTABLE=/home/filippo/tmp/pyside2/bin/python -DPYTHON_INCLUDE_DIR=/usr/include/python2.7 -DPYTHON_LIBRARY=/usr/lib/x86_64-linux-gnu/libpython2.7.so -DQT_SRC_DIR=/home/filippo/Qt/5.8/gcc_64
      -- The C compiler identification is GNU 5.4.0
      -- The CXX compiler identification is GNU 5.4.0
      -- Check for working C compiler: /usr/bin/cc
      -- Check for working C compiler: /usr/bin/cc -- works
      -- Detecting C compiler ABI info
      -- Detecting C compiler ABI info - done
      -- Detecting C compile features
      -- Detecting C compile features - done
      -- Check for working CXX compiler: /usr/bin/c++
      -- Check for working CXX compiler: /usr/bin/c++ -- works
      -- Detecting CXX compiler ABI info
      -- Detecting CXX compiler ABI info - done
      -- Detecting CXX compile features
      -- Detecting CXX compile features - done
      -- Found PythonLibs: /usr/lib/x86_64-linux-gnu/libpython2.7.so (found suitable version "2.7.12", minimum required is "2.6") 
      -- Found PythonInterp: /home/filippo/tmp/pyside2/bin/python (found suitable version "2.7.12", minimum required is "2.6") 
      PYTHON_MULTIARCH_SUFFIX: x86_64-linux-gnu
      PYTHON_MODULE_RELEASE_SUFFIX: 
      PYTHON_EXTENSION_SUFFIX: .x86_64-linux-gnu
      -- libshiboken built for Release
      result:/usr/include/GL/gl.h
      Qt5Core_INCLUDE_DIRS /home/filippo/Qt/5.8/gcc_64/include/;/home/filippo/Qt/5.8/gcc_64/include/QtCore;/home/filippo/Qt/5.8/gcc_64/.//mkspecs/linux-g++
      -- *** computed QT_INCLUDE_DIR as /home/filippo/Qt/5.8/gcc_64/include/
      CMake Warning at CMakeLists.txt:204 (find_package):
        By not providing "FindQt5WebKit.cmake" in CMAKE_MODULE_PATH this project
        has asked CMake to find a package configuration file provided by
        "Qt5WebKit", but CMake did not find one.
      
        Could not find a package configuration file provided by "Qt5WebKit" with
        any of the following names:
      
          Qt5WebKitConfig.cmake
          qt5webkit-config.cmake
      
        Add the installation prefix of "Qt5WebKit" to CMAKE_PREFIX_PATH or set
        "Qt5WebKit_DIR" to a directory containing one of the above files.  If
        "Qt5WebKit" provides a separate development package or SDK, be sure it has
        been installed.
      
      
      CMake Warning at CMakeLists.txt:205 (find_package):
        By not providing "FindQt5WebKitWidgets.cmake" in CMAKE_MODULE_PATH this
        project has asked CMake to find a package configuration file provided by
        "Qt5WebKitWidgets", but CMake did not find one.
      
        Could not find a package configuration file provided by "Qt5WebKitWidgets"
        with any of the following names:
      
          Qt5WebKitWidgetsConfig.cmake
          qt5webkitwidgets-config.cmake
      
        Add the installation prefix of "Qt5WebKitWidgets" to CMAKE_PREFIX_PATH or
        set "Qt5WebKitWidgets_DIR" to a directory containing one of the above
        files.  If "Qt5WebKitWidgets" provides a separate development package or
        SDK, be sure it has been installed.
      
      
      -- Detected OS: x11
      -- PySide will be generated using the protected hack!
      CMake Warning at PySide2/CMakeLists.txt:18 (find_package):
        By not providing "FindQt5WebKit.cmake" in CMAKE_MODULE_PATH this project
        has asked CMake to find a package configuration file provided by
        "Qt5WebKit", but CMake did not find one.
      
        Could not find a package configuration file provided by "Qt5WebKit" with
        any of the following names:
      
          Qt5WebKitConfig.cmake
          qt5webkit-config.cmake
      
        Add the installation prefix of "Qt5WebKit" to CMAKE_PREFIX_PATH or set
        "Qt5WebKit_DIR" to a directory containing one of the above files.  If
        "Qt5WebKit" provides a separate development package or SDK, be sure it has
        been installed.
      
      
      CMake Warning at PySide2/CMakeLists.txt:19 (find_package):
        By not providing "FindQt5WebKitWidgets.cmake" in CMAKE_MODULE_PATH this
        project has asked CMake to find a package configuration file provided by
        "Qt5WebKitWidgets", but CMake did not find one.
      
        Could not find a package configuration file provided by "Qt5WebKitWidgets"
        with any of the following names:
      
          Qt5WebKitWidgetsConfig.cmake
          qt5webkitwidgets-config.cmake
      
        Add the installation prefix of "Qt5WebKitWidgets" to CMAKE_PREFIX_PATH or
        set "Qt5WebKitWidgets_DIR" to a directory containing one of the above
        files.  If "Qt5WebKitWidgets" provides a separate development package or
        SDK, be sure it has been installed.
      
      
      module Qt5Core found
      module Qt5Concurrent found
      module Qt5Gui found
      module Qt5Widgets found
      module Qt5PrintSupport found
      module Qt5Xml found
      module Qt5XmlPatterns found
      module Qt5Svg found
      module Qt5PrintSupport found
      module Qt5Sql found
      module Qt5Designer found
      module Qt5UiTools found
      module Qt5Test found
      module Qt5Network found
      -- optional module Qt5WebKit skipped
      -- optional module Qt5WebKitWidgets skipped
      module Qt5Script found
      module Qt5ScriptTools found
      module Qt5Help found
      module Qt5Multimedia found
      module Qt5Qml found
      module Qt5Quick found
      module Qt5QuickWidgets found
      module Qt5WebChannel found
      module Qt5WebEngineWidgets found
      module Qt5WebSockets found
      module Qt5X11Extras found
      -- Checking for QAbstractPrintDialog in Qt5Widgets -- not found
      -- Checking for QGtkStyle in Qt5Widgets -- not found
      -- Checking for QPageSetupDialog in Qt5Widgets -- not found
      -- Checking for QPrintDialog in Qt5Widgets -- not found
      -- Checking for QPrintEngine in Qt5Widgets -- not found
      -- Checking for QPrintPreviewDialog in Qt5Widgets -- not found
      -- Checking for QPrintPreviewWidget in Qt5Widgets -- not found
      -- Checking for QPrinter in Qt5Widgets -- not found
      -- Checking for QPrinterInfo in Qt5Widgets -- not found
      -- Checking for QSessionManager in Qt5Widgets -- not found
      -- Checking for QSizeGrip in Qt5Widgets -- not found
      -- Checking for QSystemTrayIcon in Qt5Widgets -- not found
      -- Checking for QMacStyle in Qt5Widgets -- not found
      -- Checking for QSslCertificate in QtNetwork -- not found
      -- Checking for QSslCipher in QtNetwork -- not found
      -- Checking for QSslConfiguration in QtNetwork -- not found
      -- Checking for QSslError in QtNetwork -- not found
      -- Checking for QSslKey in QtNetwork -- not found
      -- Checking for QSslSocket in QtNetwork -- not found
      -- QT_SRC_DIR variable not set or graphviz not found, apidoc generation targets disabled.
      -- Configuring done
      CMake Warning (dev) at tests/pysidetest/CMakeLists.txt:101 (add_dependencies):
        Policy CMP0046 is not set: Error on non-existent dependency in
        add_dependencies.  Run "cmake --help-policy CMP0046" for policy details.
        Use the cmake_policy command to set the policy and suppress this warning.
      
        The dependency target "libpyside" of target "testbinding" does not exist.
      This warning is for project developers.  Use -Wno-dev to suppress it.
      
      -- Generating done
      CMake Warning:
        Manually-specified variables were not used by the project:
      
          QT_QMAKE_EXECUTABLE
      
      
      -- Build files have been written to: /home/filippo/tmp/pyside2/src/pyside-setup/pyside22_build/py2.7-qt5.8.0-64bit-release/pyside2
      Compiling module pyside2...
      Running process in /home/filippo/tmp/pyside2/src/pyside-setup/pyside22_build/py2.7-qt5.8.0-64bit-release/pyside2: /usr/bin/make
      /usr/bin/make
      [  1%] Generating moc_destroylistener.cpp
      Scanning dependencies of target pyside2
      [  1%] Building CXX object libpyside/CMakeFiles/pyside2.dir/dynamicqmetaobject.cpp.o
      [  1%] Building CXX object libpyside/CMakeFiles/pyside2.dir/destroylistener.cpp.o
      [  1%] Building CXX object libpyside/CMakeFiles/pyside2.dir/signalmanager.cpp.o
      /home/filippo/tmp/pyside2/src/pyside-setup/pyside22_build/py2.7-qt5.8.0-64bit-release/pyside2/libpyside/signalmanager.cpp: In member function ‘void PySide::SignalManager::addGlobalSlot(const char*, PyObject*)’:
      /home/filippo/tmp/pyside2/src/pyside-setup/pyside22_build/py2.7-qt5.8.0-64bit-release/pyside2/libpyside/signalmanager.cpp:348:5: warning: ‘int PySide::SignalManager::addGlobalSlotGetIndex(const char*, PyObject*)’ is deprecated [-Wdeprecated-declarations]
           addGlobalSlotGetIndex(slot, callback);
           ^
      In file included from /home/filippo/tmp/pyside2/src/pyside-setup/sources/pyside2/libpyside/signalmanager.h:43:0,
                       from /home/filippo/tmp/pyside2/src/pyside-setup/pyside22_build/py2.7-qt5.8.0-64bit-release/pyside2/libpyside/signalmanager.cpp:41:
      /home/filippo/tmp/pyside2/src/pyside-setup/sources/pyside2/libpyside/signalmanager.h:101:27: note: declared here
           PYSIDE_DEPRECATED(int addGlobalSlotGetIndex(const char* slot, PyObject* callback));
                                 ^
      /home/filippo/tmp/pyside2/src/pyside-setup/sources/pyside2/libpyside/pysidemacros.h:57:41: note: in definition of macro ‘PYSIDE_DEPRECATED’
               #define PYSIDE_DEPRECATED(func) func __attribute__ ((deprecated))
                                               ^
      /home/filippo/tmp/pyside2/src/pyside-setup/pyside22_build/py2.7-qt5.8.0-64bit-release/pyside2/libpyside/signalmanager.cpp:348:41: warning: ‘int PySide::SignalManager::addGlobalSlotGetIndex(const char*, PyObject*)’ is deprecated [-Wdeprecated-declarations]
           addGlobalSlotGetIndex(slot, callback);
                                               ^
      In file included from /home/filippo/tmp/pyside2/src/pyside-setup/sources/pyside2/libpyside/signalmanager.h:43:0,
                       from /home/filippo/tmp/pyside2/src/pyside-setup/pyside22_build/py2.7-qt5.8.0-64bit-release/pyside2/libpyside/signalmanager.cpp:41:
      /home/filippo/tmp/pyside2/src/pyside-setup/sources/pyside2/libpyside/signalmanager.h:101:27: note: declared here
           PYSIDE_DEPRECATED(int addGlobalSlotGetIndex(const char* slot, PyObject* callback));
                                 ^
      /home/filippo/tmp/pyside2/src/pyside-setup/sources/pyside2/libpyside/pysidemacros.h:57:41: note: in definition of macro ‘PYSIDE_DEPRECATED’
               #define PYSIDE_DEPRECATED(func) func __attribute__ ((deprecated))
                                               ^
      [  1%] Building CXX object libpyside/CMakeFiles/pyside2.dir/globalreceiver.cpp.o
      [  1%] Building CXX object libpyside/CMakeFiles/pyside2.dir/globalreceiverv2.cpp.o
      [  1%] Building CXX object libpyside/CMakeFiles/pyside2.dir/pysideclassinfo.cpp.o
      [  1%] Building CXX object libpyside/CMakeFiles/pyside2.dir/pysidemetafunction.cpp.o
      [  1%] Building CXX object libpyside/CMakeFiles/pyside2.dir/pysidesignal.cpp.o
      [  2%] Building CXX object libpyside/CMakeFiles/pyside2.dir/pysideslot.cpp.o
      [  2%] Building CXX object libpyside/CMakeFiles/pyside2.dir/pysideproperty.cpp.o
      [  2%] Building CXX object libpyside/CMakeFiles/pyside2.dir/pysideqflags.cpp.o
      [  2%] Building CXX object libpyside/CMakeFiles/pyside2.dir/pysideweakref.cpp.o
      [  2%] Building CXX object libpyside/CMakeFiles/pyside2.dir/pyside.cpp.o
      [  2%] Building CXX object libpyside/CMakeFiles/pyside2.dir/moc_destroylistener.cpp.o
      [  2%] Linking CXX shared library libpyside2.x86_64-linux-gnu.so
      [  2%] Built target pyside2
      [  2%] Generating moc_customwidgets.cpp
      [  2%] Generating moc_customwidget.cpp
      Scanning dependencies of target uiplugin
      [  2%] Building CXX object plugins/CMakeFiles/uiplugin.dir/customwidgets.cpp.o
      [  2%] Building CXX object plugins/CMakeFiles/uiplugin.dir/customwidget.cpp.o
      [  2%] Building CXX object plugins/CMakeFiles/uiplugin.dir/moc_customwidget.cpp.o
      [  2%] Building CXX object plugins/CMakeFiles/uiplugin.dir/moc_customwidgets.cpp.o
      [  3%] Linking CXX static library libuiplugin.a
      [  3%] Built target uiplugin
      [  3%] Running generator for QtCore...
      clang_parseTranslationUnit2(0x0, cmd[16]=-nostdinc -I/usr/include/c++/5 -I/usr/include/x86_64-linux-gnu/c++/5 -I/usr/include/c++/5/backward -I/usr/lib/gcc/x86_64-linux-gnu/5/include -I/usr/local/include -I/usr/lib/gcc/x86_64-linux-gnu/5/include-fixed -I/usr/include/x86_64-linux-gnu -I/usr/include -std=c++14 -fPIC -fno-exceptions -Wno-constant-logical-operand -I/home/filippo/tmp/pyside2/src/pyside-setup/sources/pyside2/PySide2 -I/home/filippo/Qt/5.8/gcc_64/include/ /tmp/pyside2_global_J19794.hpp)
      /home/filippo/Qt/5.8/gcc_64/include/QtMultimedia/qtmultimediadefs.h:1:10: fatal error: '../../src/multimedia/qtmultimediadefs.h' file not found
      Errors in /tmp/pyside2_global_J19794.hpp:
      /home/filippo/Qt/5.8/gcc_64/include/QtMultimedia/qtmultimediadefs.h:1:10: fatal: '../../src/multimedia/qtmultimediadefs.h' file not found
         /tmp/pyside2_global_J19794.hpp:72:10: note: in file included from /tmp/pyside2_global_J19794.hpp:72:
         /home/filippo/Qt/5.8/gcc_64/include/QtMultimedia/QtMultimedia:77:10: note: in file included from /home/filippo/Qt/5.8/gcc_64/include/QtMultimedia/QtMultimedia:77:
      
      
      Clang: 1 diagnostic messages:
        /home/filippo/Qt/5.8/gcc_64/include/QtMultimedia/qtmultimediadefs.h:1:10: fatal: '../../src/multimedia/qtmultimediadefs.h' file not found
         /tmp/pyside2_global_J19794.hpp:72:10: note: in file included from /tmp/pyside2_global_J19794.hpp:72:
         /home/filippo/Qt/5.8/gcc_64/include/QtMultimedia/QtMultimedia:77:10: note: in file included from /home/filippo/Qt/5.8/gcc_64/include/QtMultimedia/QtMultimedia:77:
      
      
      Keeping temporary file: /tmp/pyside2_global_J19794.hpp
      shiboken: Error running ApiExtractor.
      Command line: --generator-set=shiboken --enable-parent-ctor-heuristic --enable-pyside-extensions --enable-return-value-heuristic --use-isnull-as-nb_nonzero /home/filippo/tmp/pyside2/src/pyside-setup/pyside22_build/py2.7-qt5.8.0-64bit-release/pyside2/PySide2/pyside2_global.h --include-paths=/home/filippo/tmp/pyside2/src/pyside-setup/sources/pyside2/PySide2:/home/filippo/Qt/5.8/gcc_64/include/ --typesystem-paths=/home/filippo/tmp/pyside2/src/pyside-setup/sources/pyside2/PySide2:/home/filippo/tmp/pyside2/src/pyside-setup/sources/pyside2/PySide2/QtCore --output-directory=/home/filippo/tmp/pyside2/src/pyside-setup/pyside22_build/py2.7-qt5.8.0-64bit-release/pyside2/PySide2/QtCore --license-file=/home/filippo/tmp/pyside2/src/pyside-setup/sources/pyside2/PySide2/QtCore/../licensecomment.txt /home/filippo/tmp/pyside2/src/pyside-setup/pyside22_build/py2.7-qt5.8.0-64bit-release/pyside2/PySide2/QtCore/typesystem_core.xml --api-version=5.8 --drop-type-entries=
      PySide2/QtCore/CMakeFiles/QtCore.dir/build.make:65: set di istruzioni per l'obiettivo "PySide2/QtCore/PySide2/QtCore/qabstractanimation_wrapper.cpp" non riuscito
      make[2]: *** [PySide2/QtCore/PySide2/QtCore/qabstractanimation_wrapper.cpp] Errore 1
      CMakeFiles/Makefile2:346: set di istruzioni per l'obiettivo "PySide2/QtCore/CMakeFiles/QtCore.dir/all" non riuscito
      make[1]: *** [PySide2/QtCore/CMakeFiles/QtCore.dir/all] Errore 2
      Makefile:138: set di istruzioni per l'obiettivo "all" non riuscito
      make: *** [all] Errore 2
      error: Error compiling pyside2
      

        Attachments

          Issue Links

          No reviews matched the request. Check your Options in the drop-down menu of this sections header.

            Activity

              People

              Assignee:
              Unassigned Unassigned
              Reporter:
              memento_mori Filippo Santovito
              Votes:
              0 Vote for this issue
              Watchers:
              3 Start watching this issue

                Dates

                Created:
                Updated:
                Resolved:

                  Gerrit Reviews

                  There are no open Gerrit changes