Uploaded image for project: 'Qt'
  1. Qt
  2. QTBUG-100032

tst_qquickwebview: malloc_consolidate(): invalid chunk size

    XMLWordPrintable

    Details

    • Type: Bug
    • Status: Closed
    • Priority: P0: Blocker
    • Resolution: Fixed
    • Affects Version/s: 6.4.0 FF
    • Fix Version/s: 6.2.5, 6.3.0 Beta1
    • Component/s: WebView
    • Labels:
      None
    • Platform/s:
      Linux/X11
    • Commits:
      6d2aa2273b (qt/qtwebengine/6.3) c8de0a3f9c (qt/qtwebengine/6.2) 6d2aa2273b (qt/qtwebengine/6.3.0) c8de0a3f9c (qt/qtwebengine/6.2) c8de0a3f9c (qt/qtwebengine/6.2)

      Description

      Totals: 21 passed, 0 failed, 0 skipped, 0 blacklisted, 4534ms
      agent:2022/01/18 14:50:37 build.go:394: 2: ********* Finished testing of tst_QQuickWebView *********
      agent:2022/01/18 14:50:37 build.go:394: 2: malloc_consolidate(): invalid chunk size
      agent:2022/01/18 14:50:37 build.go:394: 2: qt-testrunner.py     INFO: Test process exited with code: -6
      agent:2022/01/18 14:50:37 build.go:394: 2: qt-testrunner.py     INFO: Parsed XML file /home/qt/work/testresults/tst_qquickwebview.xml in 0.000 seconds
      agent:2022/01/18 14:50:37 build.go:394: 2: qt-testrunner.py     INFO: Found 21 passes and 0 failures
      agent:2022/01/18 14:50:37 build.go:394: 2: qt-testrunner.py    ERROR: Uncontrolled test CRASH! Details:
      agent:2022/01/18 14:50:37 build.go:394: 2: Traceback (most recent call last):
      agent:2022/01/18 14:50:37 build.go:394: 2:   File "/home/qt/work/install/libexec/qt-testrunner.py", line 321, in main
      agent:2022/01/18 14:50:37 build.go:394: 2:     assert len(failed_functions) > 0, \
      agent:2022/01/18 14:50:37 build.go:394: 2: AssertionError: The XML test log should contain at least one failure!
      agent:2022/01/18 14:50:37 build.go:394: 2: qt-testrunner.py    ERROR: Full test run failed repeatedly, aborting!
      agent:2022/01/18 14:50:37 build.go:394: 2: CMake Error at tst_qquickwebviewWrapperRelWithDebInfo.cmake:17 (message):
      agent:2022/01/18 14:50:37 build.go:394: 2:   /home/qt/work/install/libexec/qt-testrunner.py --
      agent:2022/01/18 14:50:37 build.go:394: 2:   /home/qt/work/qt/qtwebview_standalone_tests/tests/auto/qml/qquickwebview/tst_qquickwebview
      agent:2022/01/18 14:50:37 build.go:394: 2:   execution failed with exit code 3.
      agent:2022/01/18 14:50:37 build.go:394: 2: 
      agent:2022/01/18 14:50:37 build.go:394: 2: 
      agent:2022/01/18 14:50:37 build.go:394: 2/2 Test #2: tst_qquickwebview ................***Failed   11.01 sec
      agent:2022/01/18 14:50:37 build.go:394: 50% tests passed, 1 tests failed out of 2
      agent:2022/01/18 14:50:37 build.go:394: Label Time Summary:
      agent:2022/01/18 14:50:37 build.go:394: tests/auto/qml/qquickwebview/tst_qquickwebview    =  11.01 sec*proc (1 test)
      agent:2022/01/18 14:50:37 build.go:394: tests/auto/webview/qwebview/tst_qwebview          =   2.29 sec*proc (1 test)
      agent:2022/01/18 14:50:37 build.go:394: Total Test time (real) =  13.32 sec
      agent:2022/01/18 14:50:37 build.go:394: The following tests FAILED:
      agent:2022/01/18 14:50:37 build.go:394: 	  2 - tst_qquickwebview (Failed)
      agent:2022/01/18 14:50:37 build.go:394: Errors while running CTest
      agent:2022/01/18 14:50:37 build.go:394: Output from these tests are in: /home/qt/work/qt/qtwebview_standalone_tests/Testing/Temporary/LastTest.log
      agent:2022/01/18 14:50:37 build.go:394: Use "--rerun-failed --output-on-failure" to re-run the failed cases verbosely.
      agent:2022/01/18 14:50:37 build.go:445: Process finished with error: exit status 8
      agent:2022/01/18 14:50:37 build.go:805: Executing scheduled instruction 1 of 3 - Upload all core dumps if there are some
      agent:2022/01/18 14:50:37 build.go:635: Skip uploading core files because CORE_FILES_PATH is not set in the environment
      

      Build log: https://testresults.qt.io/logs/qt/qtwebview/859c1175b3a972bfe294adc44f8f8c87cb3420b8/LinuxUbuntu_20_04x86_64LinuxUbuntu_20_04x86_64GCCqtci-linux-Ubuntu-20.04-x86_64-50-ba37a9Sccache/51f650b298f115e9a37ce02505fd09fe9217307c/test_1642514790/log.txt.gz

      Details: https://testresults.qt.io/coin/integration/qt/qtwebview/tasks/1642514284

      Tested changes (refs/builds/qtci/dev/1642512870):

      https://codereview.qt-project.org/c/qt/qtwebview/+/387635/4 Add libraries that supposed to be in rpath to PUBLIC_LIBRARIES
      https://codereview.qt-project.org/c/qt/qtwebview/+/390062/3 Update dependencies on 'dev' in qt/qtwebview

        Attachments

        No reviews matched the request. Check your Options in the drop-down menu of this sections header.

          Activity

            People

            Assignee:
            kiburtse Kirill Burtsev
            Reporter:
            janihe Jani Heikkinen
            Votes:
            0 Vote for this issue
            Watchers:
            5 Start watching this issue

              Dates

              Created:
              Updated:
              Resolved:

                Gerrit Reviews

                There are no open Gerrit changes