Uploaded image for project: 'Qt'
  1. Qt
  2. QTBUG-28845

Failed build ANGLE

    XMLWordPrintable

    Details

    • Type: Bug
    • Status: Closed
    • Priority: Not Evaluated
    • Resolution: Invalid
    • Affects Version/s: 5.0.0
    • Fix Version/s: None
    • Component/s: GUI: OpenGL
    • Labels:
      None
    • Environment:
      Windows 7 64-bit, mingw-w64 gcc-4.7.2

      Description

      I configure Qt5 with "-angle" option but when I try to build Ihave error:
      g++ -c -pipe -fno-keep-inline-dllexport -g -std=c+0x -fexceptions -mthreads -fno-rtti -Wall -Wextra -Wno-unknown-pragmas -Wno-comment -Wno-missing-field-initializers -Wno-switch -Wno-unused-parameter -Wno-write-strings -Wno-sign-compare -Wno-missing-braces -Wno-unused-but-set-variable -Wno-unused-variable -Wno-narrowing -Wno-maybe-uninitialized -Wno-strict-aliasing -Wno-type-limits -Wno-reorder -Wno-conversion-null -Wno-delete-non-virtual-dtor -DUNICODE -D_WINDOWS -D_UNICODE -D_CRT_SECURE_NO_DEPRECATE -D_HAS_EXCEPTIONS=0 -DNOMINMAX -DWIN32_LEAN_AND_MEAN=1 -D_WIN32_WINNT=0x0600 -DWINVER=0x0600 -DANGLE_DISABLE_TRACE -DANGLE_DISABLE_PERF -DANGLE_COMPILE_OPTIMIZATION_LEVEL=D3DCOMPILE_OPTIMIZATION_LEVEL0 -DANGLE_USE_NEW_PREPROCESSOR=1 -D_DEBUG -DQT_NO_DYNAMIC_CAST -IC:/SDK/ports/work/build-x32/qt5/qt-everywhere-opensource-src-5.0.0/qtbase/src/angle/src/libGLESv2 -I'C:/SDK/ports/work/build-x32/qt5/qt-everywhere-opensource-src-5.0.0/qtbase/src/angle/src/libGLESv2' -I'C:/SDK/ports/work/build-x32/qt5/qt-everywhere-opensource-src-5.0.0/qtbase/src/angle/src' -I'C:/SDK/ports/work/build-x32/qt5/qt-everywhere-opensource-src-5.0.0/qtbase/src/angle/src/../include' -I'C:/SDK/ports/work/build-x32/qt5/qt-everywhere-opensource-src-5.0.0/qtbase/src/3rdparty/angle/src' -I'C:/SDK/ports/work/build-x32/qt5/qt-everywhere-opensource-src-5.0.0/qtbase/src/3rdparty/angle/include' -I'../../src' -I'C:/SDK/msys/toolchains/mingw32/i686-w64-mingw32/include' -I'C:/SDK/ported-x32/include' -I'C:/SDK/ported-x32/include/libxml2' -I'C:/SDK/Qt5-x32/databases/firebird/include' -I'C:/SDK/Qt5-x32/databases/mysql/include/mysql' -I'C:/SDK/Qt5-x32/databases/pgsql/include' -I'.' -I'../../../../mkspecs/win32-g+' -o .obj/debug_shared/Blit.o C:/SDK/ports/work/build-x32/qt5/qt-everywhere-opensource-src-5.0.0/qtbase/src/3rdparty/angle/src/libGLESv2/Blit.cpp
      C:/SDK/ports/work/build-x32/qt5/qt-everywhere-opensource-src-5.0.0/qtbase/src/3rdparty/angle/src/libGLESv2/Blit.cpp:18:42: fatal error: libGLESv2/shaders/standardvs.h: No such file or directory
      C:/SDK/ports/work/build-x32/qt5/qt-everywhere-opensource-src-5.0.0/qtbase/src/3rdparty/angle/src/libGLESv2/Blit.cpp:18:42: fatal error: libGLESv2/shaders/standardvs.h: No such file or directory
      compilation terminated.
      compilation terminated.
      Makefile.Debug:683: recipe for target '.obj/debug_shared/Blit.o' failed
      mingw32-make[6]: *** [.obj/debug_shared/Blit.o] Error 1

        Attachments

        No reviews matched the request. Check your Options in the drop-down menu of this sections header.

          Activity

            People

            Assignee:
            kkohne Kai Köhne
            Reporter:
            alexpux Alexey Pavlov
            Votes:
            0 Vote for this issue
            Watchers:
            7 Start watching this issue

              Dates

              Created:
              Updated:
              Resolved:

                Gerrit Reviews

                There are no open Gerrit changes