Uploaded image for project: 'Qt'
  1. Qt
  2. QTBUG-51689

'unresolved external symbols' errors while building QtSerialBus examples and tools on Windows

    XMLWordPrintable

    Details

    • Type: Bug
    • Status: Closed
    • Priority: Not Evaluated
    • Resolution: Duplicate
    • Affects Version/s: 5.7
    • Fix Version/s: 5.6.0
    • Component/s: SerialBus: CAN Bus
    • Labels:
      None
    • Environment:

      Description

      Hi, everyone,

      Got errors while building Qt:

      • 'unresolved external symbol "struct...',
      • 'canbusutil_plugin_import.o:canbusutil_plugin_import.cpp.text.startup+0xe): undefined reference to `qt_static_plugin_PeakCanBusPlugin()'
        collect2.exe: error: ld returned 1 exit status',
      • 'canbusutil.exe : fatal error LNK1120: 2 unresolved externals',
      • 'can.exe : fatal error LNK1120: 2 unresolved externals',
      • 'collect2.exe: error: ld returned 1 exit status',

      inherent to static layout only, using MinGW-W64, Intel or Microsoft Compiler (logs added in attachment).

      Regards,

      Alexander

        Attachments

          Issue Links

          No reviews matched the request. Check your Options in the drop-down menu of this sections header.

            Activity

              People

              Assignee:
              ablasche Alex Blasche
              Reporter:
              sav sav
              Votes:
              0 Vote for this issue
              Watchers:
              2 Start watching this issue

                Dates

                Created:
                Updated:
                Resolved:

                  Gerrit Reviews

                  There are no open Gerrit changes