Uploaded image for project: 'Qt'
  1. Qt
  2. QTBUG-51847

Build Error: gyp-win-tool action-wrapper environment.x64 - QCommandLineParser: argument list cannot be empty

    Details

    • Type: Bug
    • Status: Closed
    • Priority: P1: Critical
    • Resolution: Done
    • Affects Version/s: 5.6.0, 5.7.0 Alpha
    • Fix Version/s: 5.6.1
    • Component/s: WebEngine
    • Labels:
      None
    • Environment:
      * Windows 10 Pro 10586 x64
      * VS 2015 Community Update 1 x64, CMD Window
      * ActivePython 2.7.10.12 x64
    • Commits:
      204de3973d7063f9ec65c0cd1ac15a13cde228c6

      Description

      Not sure If MOC is reading the File Wrong or not so I added it just in case.

      EDIT01: Using the 5.7.0 Source Archive from: download.qt.io Single '7Z' Archive
      EDIT02: Sorry: Here is now the "Full" VS Native CMD Window Output (as far as the Buffer reaches back):

      [12754/12950] CXX obj\src\3rdparty\chromium\content\renderer\pepper\content_renderer.ppb_proxy_impl.obj
      [12755/12950] CXX obj\src\3rdparty\chromium\content\renderer\pepper\content_renderer.video_decoder_shim.obj
      [12756/12950] CXX obj\src\3rdparty\chromium\content\renderer\pepper\content_renderer.url_response_info_util.obj
      [12757/12950] CXX obj\src\3rdparty\chromium\content\renderer\pepper\content_renderer.ppb_var_deprecated_impl.obj
      [12758/12950] CXX obj\src\3rdparty\chromium\content\renderer\pepper\content_renderer.url_request_info_util.obj
      [12759/12950] CXX obj\src\3rdparty\chromium\content\renderer\pepper\content_renderer.v8_var_converter.obj
      [12760/12950] CXX obj\src\3rdparty\chromium\content\renderer\pepper\content_renderer.v8object_var.obj
      [12761/12950] CXX obj\src\3rdparty\chromium\content\renderer\pepper\content_renderer.plugin_power_saver_helper.obj
      [12762/12950] CXX obj\src\3rdparty\chromium\content\renderer\pepper\content_renderer.resource_creation_impl.obj
      [12763/12950] CXX obj\src\3rdparty\chromium\content\renderer\pepper\content_renderer.video_encoder_shim.obj
      [12764/12950] CXX obj\src\3rdparty\chromium\content\renderer\pepper\content_renderer.ppb_flash_message_loop_impl.obj
      [12765/12950] CXX obj\src\3rdparty\chromium\content\public\utility\content_utility.utility_thread.obj
      [12766/12950] CXX obj\src\3rdparty\chromium\content\utility\content_utility.in_process_utility_thread.obj
      [12767/12950] CXX obj\src\3rdparty\chromium\content\utility\content_utility.utility_blink_platform_impl.obj
      [12768/12950] CXX obj\src\3rdparty\chromium\content\renderer\pepper\content_renderer.pepper_media_stream_video_track_host.obj
      [12769/12950] CXX obj\src\3rdparty\chromium\content\renderer\pepper\content_renderer.pepper_media_stream_track_host_base.obj
      [12770/12950] CXX obj\src\3rdparty\chromium\content\public\utility\content_utility.content_utility_client.obj
      [12771/12950] CXX obj\src\3rdparty\chromium\content\utility\content_utility.utility_main.obj
      [12772/12950] CXX obj\src\3rdparty\chromium\content\gen\components\webusb\public\interfaces\content_renderer.webusb_permission_bubble.mojom.obj
      [12773/12950] CXX obj\src\3rdparty\chromium\content\renderer\pepper\content_renderer.pepper_media_stream_audio_track_host.obj
      [12774/12950] CXX obj\src\3rdparty\chromium\content\renderer\pepper\content_renderer.pepper_video_destination_host.obj
      [12775/12950] CXX obj\src\3rdparty\chromium\content\renderer\pepper\content_renderer.pepper_video_source_host.obj
      [12776/12950] CXX obj\src\3rdparty\chromium\content\renderer\media\content_renderer.pepper_to_video_track_adapter.obj
      [12777/12950] CXX obj\src\3rdparty\chromium\content\renderer\content_renderer.render_widget_fullscreen_pepper.obj
      [12778/12950] CXX obj\src\3rdparty\chromium\content\renderer\media\content_renderer.video_track_to_pepper_adapter.obj
      [12779/12950] LIB obj\src\3rdparty\chromium\components\devtools_http_handler.lib
      [12780/12950] STAMP obj\src\3rdparty\chromium\content\content_utility.actions_depends.stamp
      [12781/12950] CXX obj\src\3rdparty\chromium\content\utility\content_utility.webthread_impl_for_utility_thread.obj
      [12782/12950] CXX obj\src\3rdparty\chromium\content\utility\content_utility.utility_process_control_impl.obj
      [12783/12950] CXX obj\src\3rdparty\chromium\content\utility\content_utility.utility_thread_impl.obj
      [12784/12950] STAMP obj\src\core\chrome_qt.actions_depends.stamp
      [12785/12950] STAMP obj\src\3rdparty\chromium\content\content_app_browser.compile_depends.stamp
      [12786/12950] CXX obj\src\3rdparty\chromium\build\content_app_browser.precompile.obj
      [12787/12950] CXX obj\src\3rdparty\chromium\content\app\content_app_browser.content_main_runner.obj
      [12788/12950] CXX obj\src\3rdparty\chromium\content\app\mojo\content_app_browser.mojo_init.obj
      [12789/12950] CXX obj\src\3rdparty\chromium\content\app\content_app_browser.content_main.obj
      [12790/12950] CXX obj\src\3rdparty\chromium\content\public\app\content_app_browser.content_main_delegate.obj
      [12791/12950] STAMP obj\src\core\chrome_qt.compile_depends.stamp
      [12792/12950] CXX obj\src\3rdparty\chromium\chrome\common\chrome_qt.localized_error.obj
      [12793/12950] CXX obj\src\3rdparty\chromium\chrome\browser\spellchecker\chrome_qt.feedback.obj
      [12794/12950] LIB obj\src\3rdparty\chromium\content\content_utility.lib
      [12795/12950] CXX obj\src\3rdparty\chromium\base\prefs\chrome_qt.testing_pref_store.obj
      [12796/12950] CXX obj\src\3rdparty\chromium\chrome\browser\spellchecker\chrome_qt.feedback_sender.obj
      [12797/12950] LIB obj\src\3rdparty\chromium\content\content_renderer.lib
      [12798/12950] CXX obj\src\3rdparty\chromium\chrome\common\chrome_qt.chrome_switches.obj
      [12799/12950] CXX obj\src\3rdparty\chromium\chrome\browser\media\chrome_qt.desktop_streams_registry.obj
      [12800/12950] STAMP obj\src\3rdparty\chromium\content\content_app_browser.actions_depends.stamp
      [12801/12950] CXX obj\src\3rdparty\chromium\chrome\browser\spellchecker\chrome_qt.spellcheck_message_filter.obj
      [12802/12950] LIB obj\src\3rdparty\chromium\content\content_app_browser.lib
      [12803/12950] CXX obj\src\3rdparty\chromium\chrome\renderer\spellchecker\chrome_qt.custom_dictionary_engine.obj
      [12804/12950] CXX obj\src\3rdparty\chromium\chrome\browser\spellchecker\chrome_qt.spellcheck_custom_dictionary.obj
      [12805/12950] CXX obj\src\3rdparty\chromium\chrome\renderer\spellchecker\chrome_qt.spellcheck_provider.obj
      [12806/12950] CXX obj\src\3rdparty\chromium\chrome\browser\spellchecker\chrome_qt.misspelling.obj
      [12807/12950] CXX obj\src\3rdparty\chromium\chrome\browser\spellchecker\chrome_qt.spelling_service_client.obj
      [12808/12950] CXX obj\src\3rdparty\chromium\chrome\common\chrome_qt.pref_names.obj
      [12809/12950] CXX obj\src\3rdparty\chromium\chrome\browser\spellchecker\chrome_qt.spellcheck_service.obj
      [12810/12950] CXX obj\src\3rdparty\chromium\chrome\renderer\spellchecker\chrome_qt.hunspell_engine.obj
      [12811/12950] CXX obj\src\3rdparty\chromium\chrome\browser\spellchecker\chrome_qt.spellcheck_factory.obj
      [12812/12950] CXX obj\src\3rdparty\chromium\chrome\common\chrome_qt.spellcheck_common.obj
      [12813/12950] CXX obj\src\3rdparty\chromium\chrome\browser\spellchecker\chrome_qt.spellcheck_action.obj
      [12814/12950] CXX obj\src\3rdparty\chromium\chrome\renderer\spellchecker\chrome_qt.spellcheck_language.obj
      [12815/12950] CXX obj\src\3rdparty\chromium\chrome\common\chrome_qt.common_message_generator.obj
      [12816/12950] CXX obj\src\3rdparty\chromium\chrome\browser\spellchecker\chrome_qt.word_trimmer.obj
      [12817/12950] CXX obj\src\3rdparty\chromium\chrome\renderer\spellchecker\chrome_qt.spellcheck.obj
      [12818/12950] CXX obj\src\3rdparty\chromium\chrome\renderer\spellchecker\chrome_qt.spellcheck_worditerator.obj
      [12819/12950] CXX obj\src\3rdparty\chromium\chrome\browser\spellchecker\chrome_qt.spellcheck_host_metrics.obj
      [12820/12950] CXX obj\src\3rdparty\chromium\chrome\browser\spellchecker\chrome_qt.spellcheck_hunspell_dictionary.obj
      [12821/12950] STAMP obj\src\3rdparty\chromium\components\printing_renderer.compile_depends.stamp
      [12822/12950] CXX obj\src\3rdparty\chromium\chrome\browser\printing\chrome_qt.printer_query.obj
      [12823/12950] CXX obj\src\3rdparty\chromium\chrome\browser\printing\chrome_qt.print_job_manager.obj
      [12824/12950] STAMP obj\src\3rdparty\chromium\components\visitedlink_renderer.actions_depends.stamp
      [12825/12950] STAMP obj\src\3rdparty\chromium\components\web_cache_renderer.actions_depends.stamp
      [12826/12950] STAMP obj\src\3rdparty\chromium\components\visitedlink_browser.actions_depends.stamp
      [12827/12950] STAMP obj\src\3rdparty\chromium\components\visitedlink_renderer.compile_depends.stamp
      [12828/12950] CXX obj\src\3rdparty\chromium\components\visitedlink\renderer\visitedlink_renderer.visitedlink_slave.obj
      [12829/12950] CXX obj\src\3rdparty\chromium\chrome\browser\printing\chrome_qt.print_job.obj
      [12830/12950] CXX obj\src\3rdparty\chromium\components\printing\renderer\printing_renderer.print_web_view_helper.obj
      [12831/12950] CXX obj\src\3rdparty\chromium\extensions\browser\chrome_qt.notification_types.obj
      [12832/12950] STAMP obj\src\3rdparty\chromium\components\printing_renderer.actions_depends.stamp
      [12833/12950] CXX obj\src\3rdparty\chromium\components\printing\renderer\printing_renderer.print_web_view_helper_pdf_win.obj
      [12834/12950] STAMP obj\src\3rdparty\chromium\components\web_cache_renderer.compile_depends.stamp
      [12835/12950] CXX obj\src\3rdparty\chromium\chrome\browser\printing\chrome_qt.print_job_worker.obj
      [12836/12950] CXX obj\src\3rdparty\chromium\components\web_cache\renderer\web_cache_renderer.web_cache_render_process_observer.obj
      [12837/12950] CXX obj\src\3rdparty\chromium\chrome\browser\printing\chrome_qt.print_job_worker_owner.obj
      [12838/12950] LIB obj\src\3rdparty\chromium\components\visitedlink_renderer.lib
      [12839/12950] STAMP obj\src\3rdparty\chromium\components\visitedlink_browser.compile_depends.stamp
      [12840/12950] CXX obj\src\3rdparty\chromium\components\visitedlink\browser\visitedlink_browser.visitedlink_event_listener.obj
      [12841/12950] CXX obj\src\3rdparty\chromium\components\visitedlink\browser\visitedlink_browser.visitedlink_master.obj
      [12842/12950] LIB obj\src\core\chrome_qt.lib
      [12843/12950] LIB obj\src\3rdparty\chromium\components\web_cache_renderer.lib
      [12844/12950] STAMP obj\src\3rdparty\chromium\components\cdm_renderer.compile_depends.stamp
      [12845/12950] STAMP obj\src\3rdparty\chromium\content\content.actions_depends.stamp
      [12846/12950] CXX obj\src\3rdparty\chromium\components\cdm\renderer\cdm_renderer.widevine_key_systems.obj
      [12847/12950] STAMP obj\src\3rdparty\chromium\components\cdm_renderer.actions_depends.stamp
      [12848/12950] LIB obj\src\3rdparty\chromium\components\printing_renderer.lib
      [12849/12950] LIB obj\src\3rdparty\chromium\components\cdm_renderer.lib
      [12850/12950] LIB obj\src\3rdparty\chromium\components\visitedlink_browser.lib
      [12851/12950] STAMP obj\src\core\QtWebEngineCore.actions_depends.stamp
      [12852/12950] ACTION QtWebEngineCore: moc_favicon_manager.cpp_77b3603f3e0b4538e38cc350a4bda9c0
      [12853/12950] ACTION QtWebEngineCore: qrc_devtools.cpp_77b3603f3e0b4538e38cc350a4bda9c0
      [12854/12950] ACTION QtWebEngineCore: moc_url_request_custom_job_delegate.cpp_77b3603f3e0b4538e38cc350a4bda9c0
      [12855/12950] ACTION QtWebEngineCore: moc_color_chooser_controller.cpp_77b3603f3e0b4538e38cc350a4bda9c0
      [12856/12950] ACTION QtWebEngineCore: moc_javascript_dialog_controller.cpp_77b3603f3e0b4538e38cc350a4bda9c0
      [12857/12950] ACTION QtWebEngineCore: moc_authentication_dialog_controller.cpp_77b3603f3e0b4538e38cc350a4bda9c0
      FAILED: C:\Pythonx64\python.exe gyp-win-tool action-wrapper environment.x64 QtWebEngineCore_target_moc_color_chooser_controller_cpp_77b3603f3e0b4538e38cc350a4bda9c0..rsp c:/qt5src/qtwebengine\src\core
      moc: Cannot open options file specified with @
      QCommandLineParser: argument list cannot be empty, it should contain at least the executable name
      
      FAILED: C:\Pythonx64\python.exe gyp-win-tool action-wrapper environment.x64 QtWebEngineCore_target_moc_url_request_custom_job_delegate_cpp_77b3603f3e0b4538e38cc350a4bda9c0..rsp c:/qt5src/qtwebengine\src\core
      moc: Cannot open options file specified with @
      QCommandLineParser: argument list cannot be empty, it should contain at least the executable name
      
      FAILED: C:\Pythonx64\python.exe gyp-win-tool action-wrapper environment.x64 QtWebEngineCore_target_moc_javascript_dialog_controller_cpp_77b3603f3e0b4538e38cc350a4bda9c0..rsp c:/qt5src/qtwebengine\src\core
      moc: Cannot open options file specified with @
      QCommandLineParser: argument list cannot be empty, it should contain at least the executable name
      
      FAILED: C:\Pythonx64\python.exe gyp-win-tool action-wrapper environment.x64 QtWebEngineCore_target_moc_favicon_manager_cpp_77b3603f3e0b4538e38cc350a4bda9c0..rsp c:/qt5src/qtwebengine\src\core
      moc: Cannot open options file specified with @
      QCommandLineParser: argument list cannot be empty, it should contain at least the executable name
      
      FAILED: C:\Pythonx64\python.exe gyp-win-tool action-wrapper environment.x64 QtWebEngineCore_target_moc_authentication_dialog_controller_cpp_77b3603f3e0b4538e38cc350a4bda9c0..rsp c:/qt5src/qtwebengine\src\core
      moc: Cannot open options file specified with @
      QCommandLineParser: argument list cannot be empty, it should contain at least the executable name
      
      ninja: build stopped: subcommand failed.
      jom: C:\xsdf64\qtwebengine\src\core\Makefile.gyp_run.Debug [invoke_ninja] Error 1
      jom: C:\xsdf64\qtwebengine\src\core\Makefile.gyp_run [debug-all] Error 2
      jom: C:\xsdf64\qtwebengine\src\core\Makefile.gyp_run [release-all] Error 2
      jom: C:\xsdf64\qtwebengine\src\core\Makefile [sub-gyp_run-pro-make_first] Error 2
      jom: C:\xsdf64\qtwebengine\src\Makefile [sub-core-make_first] Error 2
      jom: C:\xsdf64\qtwebengine\Makefile [sub-src-make_first] Error 2
      jom: C:\xsdf64\Makefile [module-qtwebengine-make_first] Error 2
      

        Attachments

          Issue Links

          No reviews matched the request. Check your Options in the drop-down menu of this sections header.

            Activity

              People

              • Assignee:
                jbornema Joerg Bornemann
                Reporter:
                meermusik Oliver Niebuhr
              • Votes:
                0 Vote for this issue
                Watchers:
                7 Start watching this issue

                Dates

                • Created:
                  Updated:
                  Resolved:

                  Gerrit Reviews

                  There are no open Gerrit changes