Uploaded image for project: 'Qt'
  1. Qt
  2. QTBUG-57151

Static build fails without `-skip xmlpatterns`

    XMLWordPrintable

    Details

    • Type: Bug
    • Status: Open
    • Priority: P2: Important
    • Resolution: Unresolved
    • Affects Version/s: 5.6.2
    • Fix Version/s: None
    • Labels:
      None

      Description

      .obj/xmlpatternsvalidator_plugin_import.o:xmlpatternsvalidator_plugin_import.cpp:function _GLOBAL__sub_I_xmlpatternsvalidator_plugin_import.cpp: error: undefined reference to 'qt_static_plugin_QConnmanEnginePlugin()'
      .obj/xmlpatternsvalidator_plugin_import.o:xmlpatternsvalidator_plugin_import.cpp:function _GLOBAL__sub_I_xmlpatternsvalidator_plugin_import.cpp: error: undefined reference to 'qt_static_plugin_QGenericEnginePlugin()'
      .obj/xmlpatternsvalidator_plugin_import.o:xmlpatternsvalidator_plugin_import.cpp:function _GLOBAL__sub_I_xmlpatternsvalidator_plugin_import.cpp: error: undefined reference to 'qt_static_plugin_QNetworkManagerEnginePlugin()'
      collect2: error: ld returned 1 exit status
      gmake[3]: *** [../../bin/xmlpatternsvalidator] Error 1
      

        Attachments

        No reviews matched the request. Check your Options in the drop-down menu of this sections header.

          Activity

            People

            • Assignee:
              qtbuildsystem Qt Build System Team
              Reporter:
              ragnis_ Ragnis Armus
            • Votes:
              0 Vote for this issue
              Watchers:
              1 Start watching this issue

              Dates

              • Created:
                Updated:

                Gerrit Reviews

                There are no open Gerrit changes