Uploaded image for project: 'Qt'
  1. Qt
  2. QTBUG-58630

yocto build failed with wayland weston (non x11 )

    XMLWordPrintable

    Details

    • Type: Bug
    • Status: Closed
    • Priority: P1: Critical
    • Resolution: Done
    • Affects Version/s: 5.8.0
    • Fix Version/s: 5.9
    • Component/s: QPA: Wayland
    • Environment:
      i use latest yocto build system (2.1.2),
      yocto build system (2.2) on ubuntu 14.04
    • Commits:
      3d8b3113c2349b5e002ece39ff20118b471aac6e

      Description

      compiling qwayland-server-server-buffer-extension.cpp
      rm -f libQt5WaylandCompositor.so.5.8.0 libQt5WaylandCompositor.so libQt5WaylandCompositor.so.5 libQt5WaylandCompositor.so.5.8
      linking ../../lib/libQt5WaylandCompositor.so.5.8.0
      /usr/src/debug/qtwayland/5.8.0+gitAUTOINC+0e2a950895-r0/git/src/shared/qwaylandxkb.cpp:297: error: undefined reference to 'xkb_keysym_to_utf32'
      /usr/src/debug/qtwayland/5.8.0+gitAUTOINC+0e2a950895-r0/git/src/shared/qwaylandxkb.cpp:337: error: undefined reference to 'xkb_state_mod_name_is_active'
      /usr/src/debug/qtwayland/5.8.0+gitAUTOINC+0e2a950895-r0/git/src/shared/qwaylandxkb.cpp:339: error: undefined reference to 'xkb_state_mod_name_is_active'
      /usr/src/debug/qtwayland/5.8.0+gitAUTOINC+0e2a950895-r0/git/src/shared/qwaylandxkb.cpp:341: error: undefined reference to 'xkb_state_mod_name_is_active'
      /usr/src/debug/qtwayland/5.8.0+gitAUTOINC+0e2a950895-r0/git/src/shared/qwaylandxkb.cpp:343: error: undefined reference to 'xkb_state_mod_name_is_active'
      collect2: error: ld returned 1 exit status
      make[2]: *** [../../lib/libQt5WaylandCompositor.so.5.8.0] Error 1
      make[2]: Leaving directory `/media/mohsen/home/fsl-community-bsp/build-imx6qsabresd/tmp/work/cortexa9hf-neon-mx6qdl-poky-linux-gnueabi/qtwayland/5.8.0+gitAUTOINC+0e2a950895-r0/build/src/compositor'
      make[1]: *** [sub-compositor-make_first] Error 2
      make[1]: Leaving directory `/media/mohsen/home/fsl-community-bsp/build-imx6qsabresd/tmp/work/cortexa9hf-neon-mx6qdl-poky-linux-gnueabi/qtwayland/5.8.0+gitAUTOINC+0e2a950895-r0/build/src'
      make: *** [sub-src-make_first] Error 2
      WARNING: exit code 1 from a shell command.
      ERROR: oe_runmake failed
      ERROR: Function failed: do_compile (log file is located at /media/mohsen/home/fsl-community-bsp/build-imx6qsabresd/tmp/work/cortexa9hf-neon-mx6qdl-poky-linux-gnueabi/qtwayland/5.8.0+gitAUTOINC+0e2a950895-r0/temp/log.do_compile.13758)
      ERROR: Task 413 (/media/mohsen/home/fsl-community-bsp/sources/meta-qt5/recipes-qt/qt5/qtwayland_git.bb, do_compile) failed with exit code '1'
      NOTE: Tasks Summary: Attempted 3008 tasks of which 2963 didn't need to be rerun and 1 failed.
      Waiting for 0 running tasks to finish:

        Attachments

        No reviews matched the request. Check your Options in the drop-down menu of this sections header.

          Activity

            People

            • Assignee:
              johanhelsing Johan Helsing
              Reporter:
              smzahraee Mohsen Zahraee
            • Votes:
              1 Vote for this issue
              Watchers:
              7 Start watching this issue

              Dates

              • Created:
                Updated:
                Resolved:

                Gerrit Reviews

                There are no open Gerrit changes