Uploaded image for project: 'Qt'
  1. Qt
  2. QTBUG-60034

QtQuickCompiler code that doesn't compile

    XMLWordPrintable

    Details

    • Type: Bug
    • Status: Closed
    • Priority: Not Evaluated
    • Resolution: Done
    • Affects Version/s: 5.9.0 Beta 1
    • Fix Version/s: 5.9.0 RC
    • Labels:
      None
    • Environment:
      Windows, MSVC2015, UWP arm, SDK 15063

      Description

      Trying to compile the declarative-camera example against UWP 2015 arm results in following compile error:

      12:40:20: Running steps for project declarative-camera...
      12:40:20: Starting: "C:\Qt\5.9\winrt_armv7_msvc2015\bin\qmake.exe" C:\Qt\Examples\Qt-5.9\multimedia\declarative-camera\declarative-camera.pro -spec winrt-arm-msvc2015 "CONFIG+=qtquickcompiler"
      Info: creating stash file C:\Qt\Examples\Qt-5.9\multimedia\build-declarative-camera-Qt_5_9_0_for_UWP_armv7-Release\.qmake.stash
      Project MESSAGE: This project is using private headers and will therefore be tied to this specific Qt module build version.
      Project MESSAGE: Running this project against other versions of the Qt modules may crash at any arbitrary point.
      Project MESSAGE: This is not a bug, but a result of using Qt internals. You have been warned!
      12:40:21: The process "C:\Qt\5.9\winrt_armv7_msvc2015\bin\qmake.exe" exited normally.
      12:40:21: Starting: "C:\Qt\Tools\QtCreator\bin\jom.exe" qmake_all
      
      jom 1.1.2 - empower your cores
      
      12:40:21: The process "C:\Qt\Tools\QtCreator\bin\jom.exe" exited normally.
      12:40:21: Starting: "C:\Qt\Tools\QtCreator\bin\jom.exe" 
      	C:\Qt\Tools\QtCreator\bin\jom.exe -f Makefile.Release
      	cl -c -nologo -FS -FS -Zc:strictStrings -Zc:throwingNew -O2 -MD -GR -W3 -w34100 -w34189 -w44996 -w44456 -w44457 -w44458 -wd4577 -wd4467 -EHsc -DUNICODE -DWIN32 -DQT_LARGEFILE_SUPPORT -DQ_BYTE_ORDER=Q_LITTLE_ENDIAN -DWINAPI_FAMILY=WINAPI_FAMILY_PC_APP -DWINAPI_PARTITION_PHONE_APP=1 -DARM -D__ARM__ -D__arm__ -DQT_NO_DEBUG -DQT_QUICK_LIB -DQT_MULTIMEDIA_LIB -DQT_GUI_LIB -DQT_QML_LIB -DQT_NETWORK_LIB -DQT_CORE_LIB -DQT_QML_LIB -DQT_NETWORK_LIB -DQT_CORE_LIB -DNDEBUG -I..\declarative-camera -I. -I..\..\..\..\5.9\winrt_armv7_msvc2015\include -I..\..\..\..\5.9\winrt_armv7_msvc2015\include\QtQuick -I..\..\..\..\5.9\winrt_armv7_msvc2015\include\QtMultimedia -I..\..\..\..\5.9\winrt_armv7_msvc2015\include\QtGui -I..\..\..\..\5.9\winrt_armv7_msvc2015\include\QtANGLE -I..\..\..\..\5.9\winrt_armv7_msvc2015\include\QtQml -I..\..\..\..\5.9\winrt_armv7_msvc2015\include\QtNetwork -I..\..\..\..\5.9\winrt_armv7_msvc2015\include\QtCore -I..\..\..\..\5.9\winrt_armv7_msvc2015\include\QtQml\5.9.0 -I..\..\..\..\5.9\winrt_armv7_msvc2015\include\QtQml\5.9.0\QtQml -I..\..\..\..\5.9\winrt_armv7_msvc2015\include\QtCore\5.9.0 -I..\..\..\..\5.9\winrt_armv7_msvc2015\include\QtCore\5.9.0\QtCore -Irelease -I..\..\..\..\5.9\winrt_armv7_msvc2015\mkspecs\winrt-arm-msvc2015 -Forelease\ @C:\Users\mauri\AppData\Local\Temp\qmlcamera.obj.8156.16.jom
      qmlcamera.cpp
      	C:\Qt\5.9\winrt_armv7_msvc2015\bin\rcc.exe -name declarative_camera_qtquickcompiler declarative_camera_qtquickcompiler.qrc -o release\qrc_declarative_camera_qtquickcompiler.cpp
      	C:\Qt\5.9\winrt_armv7_msvc2015\bin\qtquickcompiler.exe --resource=C:/Qt/Examples/Qt-5.9/multimedia/declarative-camera/declarative-camera.qrc ..\declarative-camera\CameraButton.qml .qtquickcompiler\CameraButton_qml.cpp
      	C:\Qt\5.9\winrt_armv7_msvc2015\bin\qtquickcompiler.exe --resource=C:/Qt/Examples/Qt-5.9/multimedia/declarative-camera/declarative-camera.qrc ..\declarative-camera\FocusButton.qml .qtquickcompiler\FocusButton_qml.cpp
      	C:\Qt\5.9\winrt_armv7_msvc2015\bin\qtquickcompiler.exe --resource=C:/Qt/Examples/Qt-5.9/multimedia/declarative-camera/declarative-camera.qrc ..\declarative-camera\VideoPreview.qml .qtquickcompiler\VideoPreview_qml.cpp
      	C:\Qt\5.9\winrt_armv7_msvc2015\bin\qtquickcompiler.exe --resource=C:/Qt/Examples/Qt-5.9/multimedia/declarative-camera/declarative-camera.qrc ..\declarative-camera\CameraPropertyButton.qml .qtquickcompiler\CameraPropertyButton_qml.cpp
      	C:\Qt\5.9\winrt_armv7_msvc2015\bin\qtquickcompiler.exe --resource=C:/Qt/Examples/Qt-5.9/multimedia/declarative-camera/declarative-camera.qrc ..\declarative-camera\PhotoCaptureControls.qml .qtquickcompiler\PhotoCaptureControls_qml.cpp
      	C:\Qt\5.9\winrt_armv7_msvc2015\bin\qtquickcompiler.exe --resource=C:/Qt/Examples/Qt-5.9/multimedia/declarative-camera/declarative-camera.qrc ..\declarative-camera\declarative-camera.qml .qtquickcompiler\declarative-camera_qml.cpp
      	C:\Qt\5.9\winrt_armv7_msvc2015\bin\qtquickcompiler.exe --resource=C:/Qt/Examples/Qt-5.9/multimedia/declarative-camera/declarative-camera.qrc ..\declarative-camera\CameraPropertyPopup.qml .qtquickcompiler\CameraPropertyPopup_qml.cpp
      	C:\Qt\5.9\winrt_armv7_msvc2015\bin\qtquickcompiler.exe --resource=C:/Qt/Examples/Qt-5.9/multimedia/declarative-camera/declarative-camera.qrc ..\declarative-camera\CameraListPopup.qml .qtquickcompiler\CameraListPopup_qml.cpp
      	C:\Qt\5.9\winrt_armv7_msvc2015\bin\qtquickcompiler.exe --resource=C:/Qt/Examples/Qt-5.9/multimedia/declarative-camera/declarative-camera.qrc ..\declarative-camera\VideoCaptureControls.qml .qtquickcompiler\VideoCaptureControls_qml.cpp
      	C:\Qt\5.9\winrt_armv7_msvc2015\bin\qtquickcompiler.exe --resource=C:/Qt/Examples/Qt-5.9/multimedia/declarative-camera/declarative-camera.qrc ..\declarative-camera\CameraListButton.qml .qtquickcompiler\CameraListButton_qml.cpp
      	C:\Qt\5.9\winrt_armv7_msvc2015\bin\qtquickcompiler.exe --resource=C:/Qt/Examples/Qt-5.9/multimedia/declarative-camera/declarative-camera.qrc ..\declarative-camera\PhotoPreview.qml .qtquickcompiler\PhotoPreview_qml.cpp
      	C:\Qt\5.9\winrt_armv7_msvc2015\bin\qtquickcompiler.exe --resource=C:/Qt/Examples/Qt-5.9/multimedia/declarative-camera/declarative-camera.qrc ..\declarative-camera\Popup.qml .qtquickcompiler\Popup_qml.cpp
      	C:\Qt\5.9\winrt_armv7_msvc2015\bin\qtquickcompiler.exe --resource-file-mapping=C:/Qt/Examples/Qt-5.9/multimedia/declarative-camera/declarative-camera.qrc=C:/Qt/Examples/Qt-5.9/multimedia/build-declarative-camera-Qt_5_9_0_for_UWP_armv7-Release/declarative_camera_qtquickcompiler.qrc ..\declarative-camera\declarative-camera.qrc .qtquickcompiler\qtquickcompiler_loader.cpp
      	C:\Qt\5.9\winrt_armv7_msvc2015\bin\qtquickcompiler.exe --resource=C:/Qt/Examples/Qt-5.9/multimedia/declarative-camera/declarative-camera.qrc ..\declarative-camera\ZoomControl.qml .qtquickcompiler\ZoomControl_qml.cpp
      	cl -c -nologo -FS -FS -Zc:strictStrings -Zc:throwingNew -O2 -MD -GR -W3 -w34100 -w34189 -w44996 -w44456 -w44457 -w44458 -wd4577 -wd4467 -EHsc -DUNICODE -DWIN32 -DQT_LARGEFILE_SUPPORT -DQ_BYTE_ORDER=Q_LITTLE_ENDIAN -DWINAPI_FAMILY=WINAPI_FAMILY_PC_APP -DWINAPI_PARTITION_PHONE_APP=1 -DARM -D__ARM__ -D__arm__ -DQT_NO_DEBUG -DQT_QUICK_LIB -DQT_MULTIMEDIA_LIB -DQT_GUI_LIB -DQT_QML_LIB -DQT_NETWORK_LIB -DQT_CORE_LIB -DQT_QML_LIB -DQT_NETWORK_LIB -DQT_CORE_LIB -DNDEBUG -I..\declarative-camera -I. -I..\..\..\..\5.9\winrt_armv7_msvc2015\include -I..\..\..\..\5.9\winrt_armv7_msvc2015\include\QtQuick -I..\..\..\..\5.9\winrt_armv7_msvc2015\include\QtMultimedia -I..\..\..\..\5.9\winrt_armv7_msvc2015\include\QtGui -I..\..\..\..\5.9\winrt_armv7_msvc2015\include\QtANGLE -I..\..\..\..\5.9\winrt_armv7_msvc2015\include\QtQml -I..\..\..\..\5.9\winrt_armv7_msvc2015\include\QtNetwork -I..\..\..\..\5.9\winrt_armv7_msvc2015\include\QtCore -I..\..\..\..\5.9\winrt_armv7_msvc2015\include\QtQml\5.9.0 -I..\..\..\..\5.9\winrt_armv7_msvc2015\include\QtQml\5.9.0\QtQml -I..\..\..\..\5.9\winrt_armv7_msvc2015\include\QtCore\5.9.0 -I..\..\..\..\5.9\winrt_armv7_msvc2015\include\QtCore\5.9.0\QtCore -Irelease -I..\..\..\..\5.9\winrt_armv7_msvc2015\mkspecs\winrt-arm-msvc2015 -Forelease\ @C:\Users\mauri\AppData\Local\Temp\qrc_declarative_camera_qtquickcompiler.obj.8156.157.jom
      qrc_declarative_camera_qtquickcompiler.cpp
      	cl -c -nologo -FS -FS -Zc:strictStrings -Zc:throwingNew -O2 -MD -GR -W3 -w34100 -w34189 -w44996 -w44456 -w44457 -w44458 -wd4577 -wd4467 -EHsc -DUNICODE -DWIN32 -DQT_LARGEFILE_SUPPORT -DQ_BYTE_ORDER=Q_LITTLE_ENDIAN -DWINAPI_FAMILY=WINAPI_FAMILY_PC_APP -DWINAPI_PARTITION_PHONE_APP=1 -DARM -D__ARM__ -D__arm__ -DQT_NO_DEBUG -DQT_QUICK_LIB -DQT_MULTIMEDIA_LIB -DQT_GUI_LIB -DQT_QML_LIB -DQT_NETWORK_LIB -DQT_CORE_LIB -DQT_QML_LIB -DQT_NETWORK_LIB -DQT_CORE_LIB -DNDEBUG -I..\declarative-camera -I. -I..\..\..\..\5.9\winrt_armv7_msvc2015\include -I..\..\..\..\5.9\winrt_armv7_msvc2015\include\QtQuick -I..\..\..\..\5.9\winrt_armv7_msvc2015\include\QtMultimedia -I..\..\..\..\5.9\winrt_armv7_msvc2015\include\QtGui -I..\..\..\..\5.9\winrt_armv7_msvc2015\include\QtANGLE -I..\..\..\..\5.9\winrt_armv7_msvc2015\include\QtQml -I..\..\..\..\5.9\winrt_armv7_msvc2015\include\QtNetwork -I..\..\..\..\5.9\winrt_armv7_msvc2015\include\QtCore -I..\..\..\..\5.9\winrt_armv7_msvc2015\include\QtQml\5.9.0 -I..\..\..\..\5.9\winrt_armv7_msvc2015\include\QtQml\5.9.0\QtQml -I..\..\..\..\5.9\winrt_armv7_msvc2015\include\QtCore\5.9.0 -I..\..\..\..\5.9\winrt_armv7_msvc2015\include\QtCore\5.9.0\QtCore -Irelease -I..\..\..\..\5.9\winrt_armv7_msvc2015\mkspecs\winrt-arm-msvc2015 -Forelease\ @C:\Users\mauri\AppData\Local\Temp\FocusButton_qml.obj.8156.172.jom
      FocusButton_qml.cpp
      .qtquickcompiler\FocusButton_qml.cpp(34): error C2064: term does not evaluate to a function taking 2 arguments
      .qtquickcompiler\FocusButton_qml.cpp(40): error C2064: term does not evaluate to a function taking 3 arguments
      .qtquickcompiler\FocusButton_qml.cpp(45): error C2064: term does not evaluate to a function taking 2 arguments
      .qtquickcompiler\FocusButton_qml.cpp(51): error C2064: term does not evaluate to a function taking 3 arguments
      .qtquickcompiler\FocusButton_qml.cpp(59): error C2064: term does not evaluate to a function taking 2 arguments
      .qtquickcompiler\FocusButton_qml.cpp(67): error C2064: term does not evaluate to a function taking 2 arguments
      .qtquickcompiler\FocusButton_qml.cpp(76): error C2064: term does not evaluate to a function taking 3 arguments
      .qtquickcompiler\FocusButton_qml.cpp(88): error C2064: term does not evaluate to a function taking 2 arguments
      .qtquickcompiler\FocusButton_qml.cpp(97): error C2064: term does not evaluate to a function taking 3 arguments
      .qtquickcompiler\FocusButton_qml.cpp(117): error C2064: term does not evaluate to a function taking 2 arguments
      .qtquickcompiler\FocusButton_qml.cpp(123): error C2064: term does not evaluate to a function taking 3 arguments
      .qtquickcompiler\FocusButton_qml.cpp(128): error C2064: term does not evaluate to a function taking 2 arguments
      .qtquickcompiler\FocusButton_qml.cpp(134): error C2064: term does not evaluate to a function taking 3 arguments
      .qtquickcompiler\FocusButton_qml.cpp(142): error C2064: term does not evaluate to a function taking 2 arguments
      .qtquickcompiler\FocusButton_qml.cpp(154): error C2064: term does not evaluate to a function taking 2 arguments
      .qtquickcompiler\FocusButton_qml.cpp(160): error C2064: term does not evaluate to a function taking 3 arguments
      .qtquickcompiler\FocusButton_qml.cpp(165): error C2064: term does not evaluate to a function taking 2 arguments
      .qtquickcompiler\FocusButton_qml.cpp(171): error C2064: term does not evaluate to a function taking 3 arguments
      .qtquickcompiler\FocusButton_qml.cpp(179): error C2064: term does not evaluate to a function taking 2 arguments
      	cl -c -nologo -FS -FS -Zc:strictStrings -Zc:throwingNew -O2 -MD -GR -W3 -w34100 -w34189 -w44996 -w44456 -w44457 -w44458 -wd4577 -wd4467 -EHsc -DUNICODE -DWIN32 -DQT_LARGEFILE_SUPPORT -DQ_BYTE_ORDER=Q_LITTLE_ENDIAN -DWINAPI_FAMILY=WINAPI_FAMILY_PC_APP -DWINAPI_PARTITION_PHONE_APP=1 -DARM -D__ARM__ -D__arm__ -DQT_NO_DEBUG -DQT_QUICK_LIB -DQT_MULTIMEDIA_LIB -DQT_GUI_LIB -DQT_QML_LIB -DQT_NETWORK_LIB -DQT_CORE_LIB -DQT_QML_LIB -DQT_NETWORK_LIB -DQT_CORE_LIB -DNDEBUG -I..\declarative-camera -I. -I..\..\..\..\5.9\winrt_armv7_msvc2015\include -I..\..\..\..\5.9\winrt_armv7_msvc2015\include\QtQuick -I..\..\..\..\5.9\winrt_armv7_msvc2015\include\QtMultimedia -I..\..\..\..\5.9\winrt_armv7_msvc2015\include\QtGui -I..\..\..\..\5.9\winrt_armv7_msvc2015\include\QtANGLE -I..\..\..\..\5.9\winrt_armv7_msvc2015\include\QtQml -I..\..\..\..\5.9\winrt_armv7_msvc2015\include\QtNetwork -I..\..\..\..\5.9\winrt_armv7_msvc2015\include\QtCore -I..\..\..\..\5.9\winrt_armv7_msvc2015\include\QtQml\5.9.0 -I..\..\..\..\5.9\winrt_armv7_msvc2015\include\QtQml\5.9.0\QtQml -I..\..\..\..\5.9\winrt_armv7_msvc2015\include\QtCore\5.9.0 -I..\..\..\..\5.9\winrt_armv7_msvc2015\include\QtCore\5.9.0\QtCore -Irelease -I..\..\..\..\5.9\winrt_armv7_msvc2015\mkspecs\winrt-arm-msvc2015 -Forelease\ @C:\Users\mauri\AppData\Local\Temp\CameraButton_qml.obj.8156.157.jom
      CameraButton_qml.cpp
      .qtquickcompiler\CameraButton_qml.cpp(34): error C2064: term does not evaluate to a function taking 2 arguments
      .qtquickcompiler\CameraButton_qml.cpp(40): error C2064: term does not evaluate to a function taking 3 arguments
      .qtquickcompiler\CameraButton_qml.cpp(57): error C2064: term does not evaluate to a function taking 2 arguments
      .qtquickcompiler\CameraButton_qml.cpp(63): error C2064: term does not evaluate to a function taking 3 arguments
      .qtquickcompiler\CameraButton_qml.cpp(88): error C2064: term does not evaluate to a function taking 2 arguments
      .qtquickcompiler\CameraButton_qml.cpp(97): error C2064: term does not evaluate to a function taking 3 arguments
      .qtquickcompiler\CameraButton_qml.cpp(123): error C2064: term does not evaluate to a function taking 2 arguments
      .qtquickcompiler\CameraButton_qml.cpp(146): error C2064: term does not evaluate to a function taking 2 arguments
      .qtquickcompiler\CameraButton_qml.cpp(152): error C2064: term does not evaluate to a function taking 3 arguments
      .qtquickcompiler\CameraButton_qml.cpp(169): error C2064: term does not evaluate to a function taking 2 arguments
      .qtquickcompiler\CameraButton_qml.cpp(175): error C2064: term does not evaluate to a function taking 3 arguments
      .qtquickcompiler\CameraButton_qml.cpp(192): error C2064: term does not evaluate to a function taking 2 arguments
      .qtquickcompiler\CameraButton_qml.cpp(198): error C2064: term does not evaluate to a function taking 3 arguments
      .qtquickcompiler\CameraButton_qml.cpp(215): error C2064: term does not evaluate to a function taking 2 arguments
      .qtquickcompiler\CameraButton_qml.cpp(221): error C2064: term does not evaluate to a function taking 3 arguments
      .qtquickcompiler\CameraButton_qml.cpp(238): error C2064: term does not evaluate to a function taking 2 arguments
      .qtquickcompiler\CameraButton_qml.cpp(244): error C2064: term does not evaluate to a function taking 3 arguments
      .qtquickcompiler\CameraButton_qml.cpp(261): error C2064: term does not evaluate to a function taking 2 arguments
      .qtquickcompiler\CameraButton_qml.cpp(267): error C2064: term does not evaluate to a function taking 3 arguments
      .qtquickcompiler\CameraButton_qml.cpp(292): error C2064: term does not evaluate to a function taking 2 arguments
      	cl -c -nologo -FS -FS -Zc:strictStrings -Zc:throwingNew -O2 -MD -GR -W3 -w34100 -w34189 -w44996 -w44456 -w44457 -w44458 -wd4577 -wd4467 -EHsc -DUNICODE -DWIN32 -DQT_LARGEFILE_SUPPORT -DQ_BYTE_ORDER=Q_LITTLE_ENDIAN -DWINAPI_FAMILY=WINAPI_FAMILY_PC_APP -DWINAPI_PARTITION_PHONE_APP=1 -DARM -D__ARM__ -D__arm__ -DQT_NO_DEBUG -DQT_QUICK_LIB -DQT_MULTIMEDIA_LIB -DQT_GUI_LIB -DQT_QML_LIB -DQT_NETWORK_LIB -DQT_CORE_LIB -DQT_QML_LIB -DQT_NETWORK_LIB -DQT_CORE_LIB -DNDEBUG -I..\declarative-camera -I. -I..\..\..\..\5.9\winrt_armv7_msvc2015\include -I..\..\..\..\5.9\winrt_armv7_msvc2015\include\QtQuick -I..\..\..\..\5.9\winrt_armv7_msvc2015\include\QtMultimedia -I..\..\..\..\5.9\winrt_armv7_msvc2015\include\QtGui -I..\..\..\..\5.9\winrt_armv7_msvc2015\include\QtANGLE -I..\..\..\..\5.9\winrt_armv7_msvc2015\include\QtQml -I..\..\..\..\5.9\winrt_armv7_msvc2015\include\QtNetwork -I..\..\..\..\5.9\winrt_armv7_msvc2015\include\QtCore -I..\..\..\..\5.9\winrt_armv7_msvc2015\include\QtQml\5.9.0 -I..\..\..\..\5.9\winrt_armv7_msvc2015\include\QtQml\5.9.0\QtQml -I..\..\..\..\5.9\winrt_armv7_msvc2015\include\QtCore\5.9.0 -I..\..\..\..\5.9\winrt_armv7_msvc2015\include\QtCore\5.9.0\QtCore -Irelease -I..\..\..\..\5.9\winrt_armv7_msvc2015\mkspecs\winrt-arm-msvc2015 -Forelease\ @C:\Users\mauri\AppData\Local\Temp\VideoPreview_qml.obj.8156.172.jom
      VideoPreview_qml.cpp
      .qtquickcompiler\VideoPreview_qml.cpp(34): error C2064: term does not evaluate to a function taking 2 arguments
      .qtquickcompiler\VideoPreview_qml.cpp(37): error C2064: term does not evaluate to a function taking 2 arguments
      .qtquickcompiler\VideoPreview_qml.cpp(43): error C2064: term does not evaluate to a function taking 3 arguments
      .qtquickcompiler\VideoPreview_qml.cpp(51): error C2064: term does not evaluate to a function taking 2 arguments
      .qtquickcompiler\VideoPreview_qml.cpp(59): error C2064: term does not evaluate to a function taking 2 arguments
      .qtquickcompiler\VideoPreview_qml.cpp(68): error C2064: term does not evaluate to a function taking 3 arguments
      .qtquickcompiler\VideoPreview_qml.cpp(99): error C2064: term does not evaluate to a function taking 2 arguments
      .qtquickcompiler\VideoPreview_qml.cpp(122): error C2064: term does not evaluate to a function taking 2 arguments
      .qtquickcompiler\VideoPreview_qml.cpp(145): error C2064: term does not evaluate to a function taking 2 arguments
      .qtquickcompiler\VideoPreview_qml.cpp(154): error C2064: term does not evaluate to a function taking 3 arguments
      .qtquickcompiler\VideoPreview_qml.cpp(180): error C2064: term does not evaluate to a function taking 2 arguments
      	cl -c -nologo -FS -FS -Zc:strictStrings -Zc:throwingNew -O2 -MD -GR -W3 -w34100 -w34189 -w44996 -w44456 -w44457 -w44458 -wd4577 -wd4467 -EHsc -DUNICODE -DWIN32 -DQT_LARGEFILE_SUPPORT -DQ_BYTE_ORDER=Q_LITTLE_ENDIAN -DWINAPI_FAMILY=WINAPI_FAMILY_PC_APP -DWINAPI_PARTITION_PHONE_APP=1 -DARM -D__ARM__ -D__arm__ -DQT_NO_DEBUG -DQT_QUICK_LIB -DQT_MULTIMEDIA_LIB -DQT_GUI_LIB -DQT_QML_LIB -DQT_NETWORK_LIB -DQT_CORE_LIB -DQT_QML_LIB -DQT_NETWORK_LIB -DQT_CORE_LIB -DNDEBUG -I..\declarative-camera -I. -I..\..\..\..\5.9\winrt_armv7_msvc2015\include -I..\..\..\..\5.9\winrt_armv7_msvc2015\include\QtQuick -I..\..\..\..\5.9\winrt_armv7_msvc2015\include\QtMultimedia -I..\..\..\..\5.9\winrt_armv7_msvc2015\include\QtGui -I..\..\..\..\5.9\winrt_armv7_msvc2015\include\QtANGLE -I..\..\..\..\5.9\winrt_armv7_msvc2015\include\QtQml -I..\..\..\..\5.9\winrt_armv7_msvc2015\include\QtNetwork -I..\..\..\..\5.9\winrt_armv7_msvc2015\include\QtCore -I..\..\..\..\5.9\winrt_armv7_msvc2015\include\QtQml\5.9.0 -I..\..\..\..\5.9\winrt_armv7_msvc2015\include\QtQml\5.9.0\QtQml -I..\..\..\..\5.9\winrt_armv7_msvc2015\include\QtCore\5.9.0 -I..\..\..\..\5.9\winrt_armv7_msvc2015\include\QtCore\5.9.0\QtCore -Irelease -I..\..\..\..\5.9\winrt_armv7_msvc2015\mkspecs\winrt-arm-msvc2015 -Forelease\ @C:\Users\mauri\AppData\Local\Temp\declarative-camera_qml.obj.8156.188.jom
      declarative-camera_qml.cpp
      .qtquickcompiler\declarative-camera_qml.cpp(34): error C2064: term does not evaluate to a function taking 2 arguments
      .qtquickcompiler\declarative-camera_qml.cpp(43): error C2064: term does not evaluate to a function taking 3 arguments
      .qtquickcompiler\declarative-camera_qml.cpp(69): error C2064: term does not evaluate to a function taking 2 arguments
      .qtquickcompiler\declarative-camera_qml.cpp(72): error C2064: term does not evaluate to a function taking 2 arguments
      .qtquickcompiler\declarative-camera_qml.cpp(78): error C2064: term does not evaluate to a function taking 3 arguments
      .qtquickcompiler\declarative-camera_qml.cpp(86): error C2064: term does not evaluate to a function taking 4 arguments
      .qtquickcompiler\declarative-camera_qml.cpp(93): error C2064: term does not evaluate to a function taking 2 arguments
      .qtquickcompiler\declarative-camera_qml.cpp(102): error C2064: term does not evaluate to a function taking 3 arguments
      .qtquickcompiler\declarative-camera_qml.cpp(128): error C2064: term does not evaluate to a function taking 2 arguments
      .qtquickcompiler\declarative-camera_qml.cpp(131): error C2064: term does not evaluate to a function taking 2 arguments
      .qtquickcompiler\declarative-camera_qml.cpp(137): error C2064: term does not evaluate to a function taking 3 arguments
      .qtquickcompiler\declarative-camera_qml.cpp(145): error C2064: term does not evaluate to a function taking 4 arguments
      .qtquickcompiler\declarative-camera_qml.cpp(152): error C2064: term does not evaluate to a function taking 2 arguments
      .qtquickcompiler\declarative-camera_qml.cpp(161): error C2064: term does not evaluate to a function taking 3 arguments
      .qtquickcompiler\declarative-camera_qml.cpp(187): error C2064: term does not evaluate to a function taking 2 arguments
      .qtquickcompiler\declarative-camera_qml.cpp(193): error C2064: term does not evaluate to a function taking 3 arguments
      .qtquickcompiler\declarative-camera_qml.cpp(218): error C2064: term does not evaluate to a function taking 2 arguments
      .qtquickcompiler\declarative-camera_qml.cpp(221): error C2064: term does not evaluate to a function taking 2 arguments
      .qtquickcompiler\declarative-camera_qml.cpp(227): error C2064: term does not evaluate to a function taking 4 arguments
      .qtquickcompiler\declarative-camera_qml.cpp(234): error C2064: term does not evaluate to a function taking 2 arguments
      .qtquickcompiler\declarative-camera_qml.cpp(242): error C2064: term does not evaluate to a function taking 4 arguments
      .qtquickcompiler\declarative-camera_qml.cpp(249): error C2064: term does not evaluate to a function taking 2 arguments
      .qtquickcompiler\declarative-camera_qml.cpp(256): error C2064: term does not evaluate to a function taking 4 arguments
      .qtquickcompiler\declarative-camera_qml.cpp(280): error C2064: term does not evaluate to a function taking 2 arguments
      .qtquickcompiler\declarative-camera_qml.cpp(287): error C2064: term does not evaluate to a function taking 4 arguments
      .qtquickcompiler\declarative-camera_qml.cpp(304): error C2064: term does not evaluate to a function taking 2 arguments
      .qtquickcompiler\declarative-camera_qml.cpp(310): error C2064: term does not evaluate to a function taking 3 arguments
      .qtquickcompiler\declarative-camera_qml.cpp(320): error C2064: term does not evaluate to a function taking 2 arguments
      .qtquickcompiler\declarative-camera_qml.cpp(335): error C2064: term does not evaluate to a function taking 2 arguments
      .qtquickcompiler\declarative-camera_qml.cpp(358): error C2064: term does not evaluate to a function taking 2 arguments
      .qtquickcompiler\declarative-camera_qml.cpp(381): error C2064: term does not evaluate to a function taking 2 arguments
      .qtquickcompiler\declarative-camera_qml.cpp(388): error C2064: term does not evaluate to a function taking 4 arguments
      .qtquickcompiler\declarative-camera_qml.cpp(405): error C2064: term does not evaluate to a function taking 2 arguments
      .qtquickcompiler\declarative-camera_qml.cpp(411): error C2064: term does not evaluate to a function taking 3 arguments
      .qtquickcompiler\declarative-camera_qml.cpp(421): error C2064: term does not evaluate to a function taking 2 arguments
      .qtquickcompiler\declarative-camera_qml.cpp(436): error C2064: term does not evaluate to a function taking 2 arguments
      .qtquickcompiler\declarative-camera_qml.cpp(452): error C2064: term does not evaluate to a function taking 2 arguments
      .qtquickcompiler\declarative-camera_qml.cpp(462): error C2064: term does not evaluate to a function taking 2 arguments
      .qtquickcompiler\declarative-camera_qml.cpp(468): error C2064: term does not evaluate to a function taking 3 arguments
      .qtquickcompiler\declarative-camera_qml.cpp(476): error C2064: term does not evaluate to a function taking 3 arguments
      .qtquickcompiler\declarative-camera_qml.cpp(507): error C2064: term does not evaluate to a function taking 2 arguments
      .qtquickcompiler\declarative-camera_qml.cpp(533): error C2064: term does not evaluate to a function taking 2 arguments
      .qtquickcompiler\declarative-camera_qml.cpp(539): error C2064: term does not evaluate to a function taking 3 arguments
      .qtquickcompiler\declarative-camera_qml.cpp(549): error C2064: term does not evaluate to a function taking 2 arguments
      .qtquickcompiler\declarative-camera_qml.cpp(561): error C2064: term does not evaluate to a function taking 2 arguments
      .qtquickcompiler\declarative-camera_qml.cpp(567): error C2064: term does not evaluate to a function taking 3 arguments
      .qtquickcompiler\declarative-camera_qml.cpp(577): error C2064: term does not evaluate to a function taking 2 arguments
      .qtquickcompiler\declarative-camera_qml.cpp(597): error C2064: term does not evaluate to a function taking 2 arguments
      .qtquickcompiler\declarative-camera_qml.cpp(603): error C2064: term does not evaluate to a function taking 3 arguments
      .qtquickcompiler\declarative-camera_qml.cpp(608): error C2064: term does not evaluate to a function taking 2 arguments
      .qtquickcompiler\declarative-camera_qml.cpp(614): error C2064: term does not evaluate to a function taking 3 arguments
      .qtquickcompiler\declarative-camera_qml.cpp(634): error C2064: term does not evaluate to a function taking 2 arguments
      .qtquickcompiler\declarative-camera_qml.cpp(640): error C2064: term does not evaluate to a function taking 3 arguments
      .qtquickcompiler\declarative-camera_qml.cpp(657): error C2064: term does not evaluate to a function taking 2 arguments
      .qtquickcompiler\declarative-camera_qml.cpp(680): error C2064: term does not evaluate to a function taking 2 arguments
      .qtquickcompiler\declarative-camera_qml.cpp(696): error C2064: term does not evaluate to a function taking 2 arguments
      .qtquickcompiler\declarative-camera_qml.cpp(702): error C2064: term does not evaluate to a function taking 3 arguments
      .qtquickcompiler\declarative-camera_qml.cpp(712): error C2064: term does not evaluate to a function taking 2 arguments
      .qtquickcompiler\declarative-camera_qml.cpp(727): error C2064: term does not evaluate to a function taking 2 arguments
      .qtquickcompiler\declarative-camera_qml.cpp(734): error C2064: term does not evaluate to a function taking 4 arguments
      .qtquickcompiler\declarative-camera_qml.cpp(750): error C2064: term does not evaluate to a function taking 2 arguments
      .qtquickcompiler\declarative-camera_qml.cpp(757): error C2064: term does not evaluate to a function taking 4 arguments
      .qtquickcompiler\declarative-camera_qml.cpp(781): error C2064: term does not evaluate to a function taking 2 arguments
      .qtquickcompiler\declarative-camera_qml.cpp(804): error C2064: term does not evaluate to a function taking 2 arguments
      .qtquickcompiler\declarative-camera_qml.cpp(820): error C2064: term does not evaluate to a function taking 2 arguments
      .qtquickcompiler\declarative-camera_qml.cpp(826): error C2064: term does not evaluate to a function taking 3 arguments
      .qtquickcompiler\declarative-camera_qml.cpp(836): error C2064: term does not evaluate to a function taking 2 arguments
      .qtquickcompiler\declarative-camera_qml.cpp(851): error C2064: term does not evaluate to a function taking 2 arguments
      .qtquickcompiler\declarative-camera_qml.cpp(858): error C2064: term does not evaluate to a function taking 4 arguments
      .qtquickcompiler\declarative-camera_qml.cpp(874): error C2064: term does not evaluate to a function taking 2 arguments
      .qtquickcompiler\declarative-camera_qml.cpp(881): error C2064: term does not evaluate to a function taking 4 arguments
      .qtquickcompiler\declarative-camera_qml.cpp(905): error C2064: term does not evaluate to a function taking 2 arguments
      	cl -c -nologo -FS -FS -Zc:strictStrings -Zc:throwingNew -O2 -MD -GR -W3 -w34100 -w34189 -w44996 -w44456 -w44457 -w44458 -wd4577 -wd4467 -EHsc -DUNICODE -DWIN32 -DQT_LARGEFILE_SUPPORT -DQ_BYTE_ORDER=Q_LITTLE_ENDIAN -DWINAPI_FAMILY=WINAPI_FAMILY_PC_APP -DWINAPI_PARTITION_PHONE_APP=1 -DARM -D__ARM__ -D__arm__ -DQT_NO_DEBUG -DQT_QUICK_LIB -DQT_MULTIMEDIA_LIB -DQT_GUI_LIB -DQT_QML_LIB -DQT_NETWORK_LIB -DQT_CORE_LIB -DQT_QML_LIB -DQT_NETWORK_LIB -DQT_CORE_LIB -DNDEBUG -I..\declarative-camera -I. -I..\..\..\..\5.9\winrt_armv7_msvc2015\include -I..\..\..\..\5.9\winrt_armv7_msvc2015\include\QtQuick -I..\..\..\..\5.9\winrt_armv7_msvc2015\include\QtMultimedia -I..\..\..\..\5.9\winrt_armv7_msvc2015\include\QtGui -I..\..\..\..\5.9\winrt_armv7_msvc2015\include\QtANGLE -I..\..\..\..\5.9\winrt_armv7_msvc2015\include\QtQml -I..\..\..\..\5.9\winrt_armv7_msvc2015\include\QtNetwork -I..\..\..\..\5.9\winrt_armv7_msvc2015\include\QtCore -I..\..\..\..\5.9\winrt_armv7_msvc2015\include\QtQml\5.9.0 -I..\..\..\..\5.9\winrt_armv7_msvc2015\include\QtQml\5.9.0\QtQml -I..\..\..\..\5.9\winrt_armv7_msvc2015\include\QtCore\5.9.0 -I..\..\..\..\5.9\winrt_armv7_msvc2015\include\QtCore\5.9.0\QtCore -Irelease -I..\..\..\..\5.9\winrt_armv7_msvc2015\mkspecs\winrt-arm-msvc2015 -Forelease\ @C:\Users\mauri\AppData\Local\Temp\PhotoCaptureControls_qml.obj.8156.188.jom
      PhotoCaptureControls_qml.cpp
      .qtquickcompiler\PhotoCaptureControls_qml.cpp(39): error C2064: term does not evaluate to a function taking 2 arguments
      .qtquickcompiler\PhotoCaptureControls_qml.cpp(45): error C2064: term does not evaluate to a function taking 3 arguments
      .qtquickcompiler\PhotoCaptureControls_qml.cpp(70): error C2064: term does not evaluate to a function taking 2 arguments
      .qtquickcompiler\PhotoCaptureControls_qml.cpp(76): error C2064: term does not evaluate to a function taking 3 arguments
      .qtquickcompiler\PhotoCaptureControls_qml.cpp(87): error C2064: term does not evaluate to a function taking 3 arguments
      .qtquickcompiler\PhotoCaptureControls_qml.cpp(104): error C2064: term does not evaluate to a function taking 2 arguments
      .qtquickcompiler\PhotoCaptureControls_qml.cpp(110): error C2064: term does not evaluate to a function taking 3 arguments
      .qtquickcompiler\PhotoCaptureControls_qml.cpp(127): error C2064: term does not evaluate to a function taking 2 arguments
      .qtquickcompiler\PhotoCaptureControls_qml.cpp(140): error C2064: term does not evaluate to a function taking 3 arguments
      .qtquickcompiler\PhotoCaptureControls_qml.cpp(166): error C2064: term does not evaluate to a function taking 2 arguments
      .qtquickcompiler\PhotoCaptureControls_qml.cpp(172): error C2064: term does not evaluate to a function taking 3 arguments
      .qtquickcompiler\PhotoCaptureControls_qml.cpp(189): error C2064: term does not evaluate to a function taking 2 arguments
      .qtquickcompiler\PhotoCaptureControls_qml.cpp(195): error C2064: term does not evaluate to a function taking 3 arguments
      .qtquickcompiler\PhotoCaptureControls_qml.cpp(220): error C2064: term does not evaluate to a function taking 2 arguments
      .qtquickcompiler\PhotoCaptureControls_qml.cpp(226): error C2064: term does not evaluate to a function taking 3 arguments
      .qtquickcompiler\PhotoCaptureControls_qml.cpp(243): error C2064: term does not evaluate to a function taking 2 arguments
      .qtquickcompiler\PhotoCaptureControls_qml.cpp(249): error C2064: term does not evaluate to a function taking 3 arguments
      .qtquickcompiler\PhotoCaptureControls_qml.cpp(274): error C2064: term does not evaluate to a function taking 2 arguments
      .qtquickcompiler\PhotoCaptureControls_qml.cpp(280): error C2064: term does not evaluate to a function taking 3 arguments
      .qtquickcompiler\PhotoCaptureControls_qml.cpp(298): error C2064: term does not evaluate to a function taking 2 arguments
      .qtquickcompiler\PhotoCaptureControls_qml.cpp(304): error C2064: term does not evaluate to a function taking 3 arguments
      .qtquickcompiler\PhotoCaptureControls_qml.cpp(309): error C2064: term does not evaluate to a function taking 2 arguments
      .qtquickcompiler\PhotoCaptureControls_qml.cpp(315): error C2064: term does not evaluate to a function taking 3 arguments
      .qtquickcompiler\PhotoCaptureControls_qml.cpp(324): error C2064: term does not evaluate to a function taking 2 arguments
      .qtquickcompiler\PhotoCaptureControls_qml.cpp(333): error C2064: term does not evaluate to a function taking 2 arguments
      .qtquickcompiler\PhotoCaptureControls_qml.cpp(339): error C2064: term does not evaluate to a function taking 3 arguments
      .qtquickcompiler\PhotoCaptureControls_qml.cpp(344): error C2064: term does not evaluate to a function taking 2 arguments
      .qtquickcompiler\PhotoCaptureControls_qml.cpp(350): error C2064: term does not evaluate to a function taking 3 arguments
      .qtquickcompiler\PhotoCaptureControls_qml.cpp(362): error C2064: term does not evaluate to a function taking 3 arguments
      .qtquickcompiler\PhotoCaptureControls_qml.cpp(393): error C2064: term does not evaluate to a function taking 2 arguments
      .qtquickcompiler\PhotoCaptureControls_qml.cpp(399): error C2064: term does not evaluate to a function taking 3 arguments
      .qtquickcompiler\PhotoCaptureControls_qml.cpp(407): error C2064: term does not evaluate to a function taking 3 arguments
      .qtquickcompiler\PhotoCaptureControls_qml.cpp(424): error C2064: term does not evaluate to a function taking 2 arguments
      .qtquickcompiler\PhotoCaptureControls_qml.cpp(430): error C2064: term does not evaluate to a function taking 3 arguments
      .qtquickcompiler\PhotoCaptureControls_qml.cpp(441): error C2064: term does not evaluate to a function taking 3 arguments
      .qtquickcompiler\PhotoCaptureControls_qml.cpp(467): error C2064: term does not evaluate to a function taking 2 arguments
      .qtquickcompiler\PhotoCaptureControls_qml.cpp(473): error C2064: term does not evaluate to a function taking 3 arguments
      .qtquickcompiler\PhotoCaptureControls_qml.cpp(490): error C2064: term does not evaluate to a function taking 2 arguments
      .qtquickcompiler\PhotoCaptureControls_qml.cpp(496): error C2064: term does not evaluate to a function taking 3 arguments
      .qtquickcompiler\PhotoCaptureControls_qml.cpp(504): error C2064: term does not evaluate to a function taking 3 arguments
      .qtquickcompiler\PhotoCaptureControls_qml.cpp(509): error C2064: term does not evaluate to a function taking 2 arguments
      .qtquickcompiler\PhotoCaptureControls_qml.cpp(515): error C2064: term does not evaluate to a function taking 3 arguments
      .qtquickcompiler\PhotoCaptureControls_qml.cpp(523): error C2064: term does not evaluate to a function taking 4 arguments
      .qtquickcompiler\PhotoCaptureControls_qml.cpp(547): error C2064: term does not evaluate to a function taking 2 arguments
      .qtquickcompiler\PhotoCaptureControls_qml.cpp(553): error C2064: term does not evaluate to a function taking 3 arguments
      .qtquickcompiler\PhotoCaptureControls_qml.cpp(578): error C2064: term does not evaluate to a function taking 2 arguments
      .qtquickcompiler\PhotoCaptureControls_qml.cpp(584): error C2064: term does not evaluate to a function taking 3 arguments
      .qtquickcompiler\PhotoCaptureControls_qml.cpp(609): error C2064: term does not evaluate to a function taking 2 arguments
      .qtquickcompiler\PhotoCaptureControls_qml.cpp(615): error C2064: term does not evaluate to a function taking 3 arguments
      .qtquickcompiler\PhotoCaptureControls_qml.cpp(640): error C2064: term does not evaluate to a function taking 2 arguments
      .qtquickcompiler\PhotoCaptureControls_qml.cpp(646): error C2064: term does not evaluate to a function taking 3 arguments
      .qtquickcompiler\PhotoCaptureControls_qml.cpp(671): error C2064: term does not evaluate to a function taking 2 arguments
      .qtquickcompiler\PhotoCaptureControls_qml.cpp(677): error C2064: term does not evaluate to a function taking 3 arguments
      .qtquickcompiler\PhotoCaptureControls_qml.cpp(702): error C2064: term does not evaluate to a function taking 2 arguments
      .qtquickcompiler\PhotoCaptureControls_qml.cpp(711): error C2064: term does not evaluate to a function taking 3 arguments
      .qtquickcompiler\PhotoCaptureControls_qml.cpp(729): error C2064: term does not evaluate to a function taking 2 arguments
      .qtquickcompiler\PhotoCaptureControls_qml.cpp(735): error C2064: term does not evaluate to a function taking 3 arguments
      .qtquickcompiler\PhotoCaptureControls_qml.cpp(760): error C2064: term does not evaluate to a function taking 2 arguments
      .qtquickcompiler\PhotoCaptureControls_qml.cpp(766): error C2064: term does not evaluate to a function taking 3 arguments
      .qtquickcompiler\PhotoCaptureControls_qml.cpp(783): error C2064: term does not evaluate to a function taking 2 arguments
      .qtquickcompiler\PhotoCaptureControls_qml.cpp(789): error C2064: term does not evaluate to a function taking 3 arguments
      .qtquickcompiler\PhotoCaptureControls_qml.cpp(814): error C2064: term does not evaluate to a function taking 2 arguments
      .qtquickcompiler\PhotoCaptureControls_qml.cpp(820): error C2064: term does not evaluate to a function taking 3 arguments
      .qtquickcompiler\PhotoCaptureControls_qml.cpp(837): error C2064: term does not evaluate to a function taking 2 arguments
      .qtquickcompiler\PhotoCaptureControls_qml.cpp(843): error C2064: term does not evaluate to a function taking 3 arguments
      .qtquickcompiler\PhotoCaptureControls_qml.cpp(848): error C2064: term does not evaluate to a function taking 2 arguments
      .qtquickcompiler\PhotoCaptureControls_qml.cpp(854): error C2064: term does not evaluate to a function taking 4 arguments
      .qtquickcompiler\PhotoCaptureControls_qml.cpp(878): error C2064: term does not evaluate to a function taking 2 arguments
      .qtquickcompiler\PhotoCaptureControls_qml.cpp(887): error C2064: term does not evaluate to a function taking 3 arguments
      .qtquickcompiler\PhotoCaptureControls_qml.cpp(913): error C2064: term does not evaluate to a function taking 2 arguments
      .qtquickcompiler\PhotoCaptureControls_qml.cpp(922): error C2064: term does not evaluate to a function taking 3 arguments
      .qtquickcompiler\PhotoCaptureControls_qml.cpp(948): error C2064: term does not evaluate to a function taking 2 arguments
      .qtquickcompiler\PhotoCaptureControls_qml.cpp(954): error C2064: term does not evaluate to a function taking 3 arguments
      .qtquickcompiler\PhotoCaptureControls_qml.cpp(971): error C2064: term does not evaluate to a function taking 2 arguments
      .qtquickcompiler\PhotoCaptureControls_qml.cpp(977): error C2064: term does not evaluate to a function taking 3 arguments
      .qtquickcompiler\PhotoCaptureControls_qml.cpp(994): error C2064: term does not evaluate to a function taking 2 arguments
      .qtquickcompiler\PhotoCaptureControls_qml.cpp(997): error C2064: term does not evaluate to a function taking 2 arguments
      .qtquickcompiler\PhotoCaptureControls_qml.cpp(1003): error C2064: term does not evaluate to a function taking 3 arguments
      .qtquickcompiler\PhotoCaptureControls_qml.cpp(1016): error C2064: term does not evaluate to a function taking 3 arguments
      .qtquickcompiler\PhotoCaptureControls_qml.cpp(1034): error C2064: term does not evaluate to a function taking 2 arguments
      .qtquickcompiler\PhotoCaptureControls_qml.cpp(1037): error C2064: term does not evaluate to a function taking 2 arguments
      .qtquickcompiler\PhotoCaptureControls_qml.cpp(1047): error C2064: term does not evaluate to a function taking 3 arguments
      	cl -c -nologo -FS -FS -Zc:strictStrings -Zc:throwingNew -O2 -MD -GR -W3 -w34100 -w34189 -w44996 -w44456 -w44457 -w44458 -wd4577 -wd4467 -EHsc -DUNICODE -DWIN32 -DQT_LARGEFILE_SUPPORT -DQ_BYTE_ORDER=Q_LITTLE_ENDIAN -DWINAPI_FAMILY=WINAPI_FAMILY_PC_APP -DWINAPI_PARTITION_PHONE_APP=1 -DARM -D__ARM__ -D__arm__ -DQT_NO_DEBUG -DQT_QUICK_LIB -DQT_MULTIMEDIA_LIB -DQT_GUI_LIB -DQT_QML_LIB -DQT_NETWORK_LIB -DQT_CORE_LIB -DQT_QML_LIB -DQT_NETWORK_LIB -DQT_CORE_LIB -DNDEBUG -I..\declarative-camera -I. -I..\..\..\..\5.9\winrt_armv7_msvc2015\include -I..\..\..\..\5.9\winrt_armv7_msvc2015\include\QtQuick -I..\..\..\..\5.9\winrt_armv7_msvc2015\include\QtMultimedia -I..\..\..\..\5.9\winrt_armv7_msvc2015\include\QtGui -I..\..\..\..\5.9\winrt_armv7_msvc2015\include\QtANGLE -I..\..\..\..\5.9\winrt_armv7_msvc2015\include\QtQml -I..\..\..\..\5.9\winrt_armv7_msvc2015\include\QtNetwork -I..\..\..\..\5.9\winrt_armv7_msvc2015\include\QtCore -I..\..\..\..\5.9\winrt_armv7_msvc2015\include\QtQml\5.9.0 -I..\..\..\..\5.9\winrt_armv7_msvc2015\include\QtQml\5.9.0\QtQml -I..\..\..\..\5.9\winrt_armv7_msvc2015\include\QtCore\5.9.0 -I..\..\..\..\5.9\winrt_armv7_msvc2015\include\QtCore\5.9.0\QtCore -Irelease -I..\..\..\..\5.9\winrt_armv7_msvc2015\mkspecs\winrt-arm-msvc2015 -Forelease\ @C:\Users\mauri\AppData\Local\Temp\CameraPropertyButton_qml.obj.8156.172.jom
      CameraPropertyButton_qml.cpp
      .qtquickcompiler\CameraPropertyButton_qml.cpp(34): error C2064: term does not evaluate to a function taking 2 arguments
      .qtquickcompiler\CameraPropertyButton_qml.cpp(40): error C2064: term does not evaluate to a function taking 3 arguments
      .qtquickcompiler\CameraPropertyButton_qml.cpp(57): error C2064: term does not evaluate to a function taking 2 arguments
      .qtquickcompiler\CameraPropertyButton_qml.cpp(63): error C2064: term does not evaluate to a function taking 3 arguments
      .qtquickcompiler\CameraPropertyButton_qml.cpp(88): error C2064: term does not evaluate to a function taking 2 arguments
      .qtquickcompiler\CameraPropertyButton_qml.cpp(97): error C2064: term does not evaluate to a function taking 3 arguments
      .qtquickcompiler\CameraPropertyButton_qml.cpp(123): error C2064: term does not evaluate to a function taking 2 arguments
      .qtquickcompiler\CameraPropertyButton_qml.cpp(146): error C2064: term does not evaluate to a function taking 2 arguments
      .qtquickcompiler\CameraPropertyButton_qml.cpp(152): error C2064: term does not evaluate to a function taking 3 arguments
      .qtquickcompiler\CameraPropertyButton_qml.cpp(160): error C2064: term does not evaluate to a function taking 3 arguments
      .qtquickcompiler\CameraPropertyButton_qml.cpp(185): error C2064: term does not evaluate to a function taking 2 arguments
      .qtquickcompiler\CameraPropertyButton_qml.cpp(209): error C2064: term does not evaluate to a function taking 2 arguments
      .qtquickcompiler\CameraPropertyButton_qml.cpp(218): error C2064: term does not evaluate to a function taking 2 arguments
      .qtquickcompiler\CameraPropertyButton_qml.cpp(233): error C2064: term does not evaluate to a function taking 2 arguments
      .qtquickcompiler\CameraPropertyButton_qml.cpp(239): error C2064: term does not evaluate to a function taking 3 arguments
      .qtquickcompiler\CameraPropertyButton_qml.cpp(256): error C2064: term does not evaluate to a function taking 2 arguments
      .qtquickcompiler\CameraPropertyButton_qml.cpp(265): error C2064: term does not evaluate to a function taking 3 arguments
      .qtquickcompiler\CameraPropertyButton_qml.cpp(291): error C2064: term does not evaluate to a function taking 2 arguments
      .qtquickcompiler\CameraPropertyButton_qml.cpp(297): error C2064: term does not evaluate to a function taking 3 arguments
      .qtquickcompiler\CameraPropertyButton_qml.cpp(314): error C2064: term does not evaluate to a function taking 2 arguments
      .qtquickcompiler\CameraPropertyButton_qml.cpp(320): error C2064: term does not evaluate to a function taking 3 arguments
      	cl -c -nologo -FS -FS -Zc:strictStrings -Zc:throwingNew -O2 -MD -GR -W3 -w34100 -w34189 -w44996 -w44456 -w44457 -w44458 -wd4577 -wd4467 -EHsc -DUNICODE -DWIN32 -DQT_LARGEFILE_SUPPORT -DQ_BYTE_ORDER=Q_LITTLE_ENDIAN -DWINAPI_FAMILY=WINAPI_FAMILY_PC_APP -DWINAPI_PARTITION_PHONE_APP=1 -DARM -D__ARM__ -D__arm__ -DQT_NO_DEBUG -DQT_QUICK_LIB -DQT_MULTIMEDIA_LIB -DQT_GUI_LIB -DQT_QML_LIB -DQT_NETWORK_LIB -DQT_CORE_LIB -DQT_QML_LIB -DQT_NETWORK_LIB -DQT_CORE_LIB -DNDEBUG -I..\declarative-camera -I. -I..\..\..\..\5.9\winrt_armv7_msvc2015\include -I..\..\..\..\5.9\winrt_armv7_msvc2015\include\QtQuick -I..\..\..\..\5.9\winrt_armv7_msvc2015\include\QtMultimedia -I..\..\..\..\5.9\winrt_armv7_msvc2015\include\QtGui -I..\..\..\..\5.9\winrt_armv7_msvc2015\include\QtANGLE -I..\..\..\..\5.9\winrt_armv7_msvc2015\include\QtQml -I..\..\..\..\5.9\winrt_armv7_msvc2015\include\QtNetwork -I..\..\..\..\5.9\winrt_armv7_msvc2015\include\QtCore -I..\..\..\..\5.9\winrt_armv7_msvc2015\include\QtQml\5.9.0 -I..\..\..\..\5.9\winrt_armv7_msvc2015\include\QtQml\5.9.0\QtQml -I..\..\..\..\5.9\winrt_armv7_msvc2015\include\QtCore\5.9.0 -I..\..\..\..\5.9\winrt_armv7_msvc2015\include\QtCore\5.9.0\QtCore -Irelease -I..\..\..\..\5.9\winrt_armv7_msvc2015\mkspecs\winrt-arm-msvc2015 -Forelease\ @C:\Users\mauri\AppData\Local\Temp\CameraPropertyPopup_qml.obj.8156.282.jom
      CameraPropertyPopup_qml.cpp
      .qtquickcompiler\CameraPropertyPopup_qml.cpp(39): error C2064: term does not evaluate to a function taking 2 arguments
      .qtquickcompiler\CameraPropertyPopup_qml.cpp(42): error C2064: term does not evaluate to a function taking 2 arguments
      .qtquickcompiler\CameraPropertyPopup_qml.cpp(48): error C2064: term does not evaluate to a function taking 3 arguments
      .qtquickcompiler\CameraPropertyPopup_qml.cpp(60): error C2064: term does not evaluate to a function taking 3 arguments
      .qtquickcompiler\CameraPropertyPopup_qml.cpp(81): error C2064: term does not evaluate to a function taking 2 arguments
      .qtquickcompiler\CameraPropertyPopup_qml.cpp(84): error C2064: term does not evaluate to a function taking 2 arguments
      .qtquickcompiler\CameraPropertyPopup_qml.cpp(90): error C2064: term does not evaluate to a function taking 2 arguments
      .qtquickcompiler\CameraPropertyPopup_qml.cpp(96): error C2064: term does not evaluate to a function taking 3 arguments
      .qtquickcompiler\CameraPropertyPopup_qml.cpp(104): error C2064: term does not evaluate to a function taking 3 arguments
      .qtquickcompiler\CameraPropertyPopup_qml.cpp(128): error C2064: term does not evaluate to a function taking 2 arguments
      .qtquickcompiler\CameraPropertyPopup_qml.cpp(131): error C2064: term does not evaluate to a function taking 2 arguments
      .qtquickcompiler\CameraPropertyPopup_qml.cpp(137): error C2064: term does not evaluate to a function taking 3 arguments
      .qtquickcompiler\CameraPropertyPopup_qml.cpp(142): error C2064: term does not evaluate to a function taking 2 arguments
      .qtquickcompiler\CameraPropertyPopup_qml.cpp(155): error C2064: term does not evaluate to a function taking 3 arguments
      .qtquickcompiler\CameraPropertyPopup_qml.cpp(161): error C2064: term does not evaluate to a function taking 2 arguments
      .qtquickcompiler\CameraPropertyPopup_qml.cpp(167): error C2064: term does not evaluate to a function taking 2 arguments
      .qtquickcompiler\CameraPropertyPopup_qml.cpp(173): error C2064: term does not evaluate to a function taking 3 arguments
      .qtquickcompiler\CameraPropertyPopup_qml.cpp(181): error C2064: term does not evaluate to a function taking 3 arguments
      .qtquickcompiler\CameraPropertyPopup_qml.cpp(205): error C2064: term does not evaluate to a function taking 2 arguments
      .qtquickcompiler\CameraPropertyPopup_qml.cpp(214): error C2064: term does not evaluate to a function taking 3 arguments
      .qtquickcompiler\CameraPropertyPopup_qml.cpp(224): error C2064: term does not evaluate to a function taking 2 arguments
      .qtquickcompiler\CameraPropertyPopup_qml.cpp(232): error C2064: term does not evaluate to a function taking 2 arguments
      .qtquickcompiler\CameraPropertyPopup_qml.cpp(242): error C2064: term does not evaluate to a function taking 3 arguments
      .qtquickcompiler\CameraPropertyPopup_qml.cpp(251): error C2064: term does not evaluate to a function taking 3 arguments
      .qtquickcompiler\CameraPropertyPopup_qml.cpp(259): error C2064: term does not evaluate to a function taking 2 arguments
      .qtquickcompiler\CameraPropertyPopup_qml.cpp(269): error C2064: term does not evaluate to a function taking 2 arguments
      .qtquickcompiler\CameraPropertyPopup_qml.cpp(278): error C2064: term does not evaluate to a function taking 3 arguments
      .qtquickcompiler\CameraPropertyPopup_qml.cpp(293): error C2064: term does not evaluate to a function taking 2 arguments
      .qtquickcompiler\CameraPropertyPopup_qml.cpp(303): error C2064: term does not evaluate to a function taking 3 arguments
      .qtquickcompiler\CameraPropertyPopup_qml.cpp(312): error C2064: term does not evaluate to a function taking 3 arguments
      .qtquickcompiler\CameraPropertyPopup_qml.cpp(320): error C2064: term does not evaluate to a function taking 2 arguments
      .qtquickcompiler\CameraPropertyPopup_qml.cpp(357): error C2064: term does not evaluate to a function taking 2 arguments
      .qtquickcompiler\CameraPropertyPopup_qml.cpp(363): error C2064: term does not evaluate to a function taking 3 arguments
      .qtquickcompiler\CameraPropertyPopup_qml.cpp(380): error C2064: term does not evaluate to a function taking 2 arguments
      .qtquickcompiler\CameraPropertyPopup_qml.cpp(386): error C2064: term does not evaluate to a function taking 3 arguments
      .qtquickcompiler\CameraPropertyPopup_qml.cpp(403): error C2064: term does not evaluate to a function taking 2 arguments
      .qtquickcompiler\CameraPropertyPopup_qml.cpp(409): error C2064: term does not evaluate to a function taking 3 arguments
      .qtquickcompiler\CameraPropertyPopup_qml.cpp(426): error C2064: term does not evaluate to a function taking 2 arguments
      .qtquickcompiler\CameraPropertyPopup_qml.cpp(432): error C2064: term does not evaluate to a function taking 3 arguments
      .qtquickcompiler\CameraPropertyPopup_qml.cpp(444): error C2064: term does not evaluate to a function taking 3 arguments
      .qtquickcompiler\CameraPropertyPopup_qml.cpp(470): error C2064: term does not evaluate to a function taking 2 arguments
      .qtquickcompiler\CameraPropertyPopup_qml.cpp(493): error C2064: term does not evaluate to a function taking 2 arguments
      .qtquickcompiler\CameraPropertyPopup_qml.cpp(499): error C2064: term does not evaluate to a function taking 3 arguments
      .qtquickcompiler\CameraPropertyPopup_qml.cpp(524): error C2064: term does not evaluate to a function taking 2 arguments
      .qtquickcompiler\CameraPropertyPopup_qml.cpp(547): error C2064: term does not evaluate to a function taking 2 arguments
      .qtquickcompiler\CameraPropertyPopup_qml.cpp(570): error C2064: term does not evaluate to a function taking 2 arguments
      .qtquickcompiler\CameraPropertyPopup_qml.cpp(573): error C2064: term does not evaluate to a function taking 2 arguments
      .qtquickcompiler\CameraPropertyPopup_qml.cpp(579): error C2064: term does not evaluate to a function taking 4 arguments
      .qtquickcompiler\CameraPropertyPopup_qml.cpp(586): error C2064: term does not evaluate to a function taking 2 arguments
      .qtquickcompiler\CameraPropertyPopup_qml.cpp(589): error C2064: term does not evaluate to a function taking 2 arguments
      .qtquickcompiler\CameraPropertyPopup_qml.cpp(599): error C2064: term does not evaluate to a function taking 3 arguments
      .qtquickcompiler\CameraPropertyPopup_qml.cpp(625): error C2064: term does not evaluate to a function taking 2 arguments
      .qtquickcompiler\CameraPropertyPopup_qml.cpp(648): error C2064: term does not evaluate to a function taking 2 arguments
      .qtquickcompiler\CameraPropertyPopup_qml.cpp(654): error C2064: term does not evaluate to a function taking 3 arguments
      .qtquickcompiler\CameraPropertyPopup_qml.cpp(671): error C2064: term does not evaluate to a function taking 2 arguments
      .qtquickcompiler\CameraPropertyPopup_qml.cpp(677): error C2064: term does not evaluate to a function taking 3 arguments
      .qtquickcompiler\CameraPropertyPopup_qml.cpp(682): error C2064: term does not evaluate to a function taking 2 arguments
      .qtquickcompiler\CameraPropertyPopup_qml.cpp(688): error C2064: term does not evaluate to a function taking 3 arguments
      .qtquickcompiler\CameraPropertyPopup_qml.cpp(700): error C2064: term does not evaluate to a function taking 3 arguments
      .qtquickcompiler\CameraPropertyPopup_qml.cpp(709): error C2064: term does not evaluate to a function taking 3 arguments
      .qtquickcompiler\CameraPropertyPopup_qml.cpp(734): error C2064: term does not evaluate to a function taking 2 arguments
      .qtquickcompiler\CameraPropertyPopup_qml.cpp(740): error C2064: term does not evaluate to a function taking 3 arguments
      .qtquickcompiler\CameraPropertyPopup_qml.cpp(757): error C2064: term does not evaluate to a function taking 2 arguments
      .qtquickcompiler\CameraPropertyPopup_qml.cpp(763): error C2064: term does not evaluate to a function taking 3 arguments
      jom: C:\Qt\Examples\Qt-5.9\multimedia\build-declarative-camera-Qt_5_9_0_for_UWP_armv7-Release\Makefile.Release [release\FocusButton_qml.obj] Error 2
      jom: C:\Qt\Examples\Qt-5.9\multimedia\build-declarative-camera-Qt_5_9_0_for_UWP_armv7-Release\Makefile.Release [release\PhotoCaptureControls_qml.obj] Error 2
      jom: C:\Qt\Examples\Qt-5.9\multimedia\build-declarative-camera-Qt_5_9_0_for_UWP_armv7-Release\Makefile.Release [release\CameraPropertyPopup_qml.obj] Error 2
      jom: C:\Qt\Examples\Qt-5.9\multimedia\build-declarative-camera-Qt_5_9_0_for_UWP_armv7-Release\Makefile.Release [release\CameraPropertyButton_qml.obj] Error 2
      jom: C:\Qt\Examples\Qt-5.9\multimedia\build-declarative-camera-Qt_5_9_0_for_UWP_armv7-Release\Makefile.Release [release\CameraButton_qml.obj] Error 2
      jom: C:\Qt\Examples\Qt-5.9\multimedia\build-declarative-camera-Qt_5_9_0_for_UWP_armv7-Release\Makefile.Release [release\declarative-camera_qml.obj] Error 2
      jom: C:\Qt\Examples\Qt-5.9\multimedia\build-declarative-camera-Qt_5_9_0_for_UWP_armv7-Release\Makefile.Release [release\VideoPreview_qml.obj] Error 2
      jom: C:\Qt\Examples\Qt-5.9\multimedia\build-declarative-camera-Qt_5_9_0_for_UWP_armv7-Release\Makefile [release] Error 2
      12:40:23: The process "C:\Qt\Tools\QtCreator\bin\jom.exe" exited with code 2.
      Error while building/deploying project declarative-camera (kit: Qt 5.9.0 for UWP armv7)
      The kit Qt 5.9.0 for UWP armv7 has configuration issues which might be the root cause for this problem.
      When executing step "Make"
      12:40:23: Elapsed time: 00:04.
      

        Attachments

          Issue Links

          No reviews matched the request. Check your Options in the drop-down menu of this sections header.

            Activity

              People

              Assignee:
              shausman Simon Hausmann
              Reporter:
              mkalinow Maurice Kalinowski
              Votes:
              1 Vote for this issue
              Watchers:
              3 Start watching this issue

                Dates

                Created:
                Updated:
                Resolved:

                  Gerrit Reviews

                  There are no open Gerrit changes