Uploaded image for project: 'Qt'
  1. Qt
  2. QTBUG-60675

insource build of qtdeclarative fails

    XMLWordPrintable

    Details

    • Commits:
      1e8f85dbc90da6b49fa7018ccbc35db68281d395

      Description

      16:01:51 g++ -c -pipe -Wno-c++0x-compat -ffunction-sections -O2 -fPIC -std=c++1z -fvisibility=hidden -fvisibility-inlines-hidden -fno-exceptions -Wall -W -Wno-c++0x-compat -Wvla -Wdate-time -Wshift-overflow=2 -Wduplicated-cond -D_REENTRANT -DWTF_EXPORT_PRIVATE= -DJS_EXPORT_PRIVATE= -DENABLE_ASSEMBLER_WX_EXCLUSIVE=1 -DWTFReportAssertionFailure=qmlWTFReportAssertionFailure -DWTFReportBacktrace=qmlWTFReportBacktrace -DWTFInvokeCrashHook=qmlWTFInvokeCrashHook -DENABLE_LLINT=0 -DENABLE_DFG_JIT=0 -DENABLE_DFG_JIT_UTILITY_METHODS=1 -DENABLE_JIT_CONSTANT_BLINDING=0 -DBUILDING_QT__ -DWTF_USE_UDIS86=0 -DNDEBUG -DWTF_EXPORT_PRIVATE= -DJS_EXPORT_PRIVATE= -DENABLE_ASSEMBLER_WX_EXCLUSIVE=1 -DWTFReportAssertionFailure=qmlWTFReportAssertionFailure -DWTFReportBacktrace=qmlWTFReportBacktrace -DWTFInvokeCrashHook=qmlWTFInvokeCrashHook -DENABLE_LLINT=0 -DENABLE_DFG_JIT=0 -DENABLE_DFG_JIT_UTILITY_METHODS=1 -DENABLE_JIT_CONSTANT_BLINDING=0 -DBUILDING_QT__ -DWTF_USE_UDIS86=0 -DNDEBUG -DQT_NO_NARROWING_CONVERSIONS_IN_CONNECT -DQT_BUILD_QMLDEVTOOLS_LIB -DQT_BUILDING_QT -DQT_NO_CAST_TO_ASCII -DQT_ASCII_CAST_WARNINGS -DQT_MOC_COMPAT -DQT_USE_QSTRINGBUILDER -DQT_DEPRECATED_WARNINGS -DQT_DISABLE_DEPRECATED_BEFORE=0x050000 -DQT_NO_EXCEPTIONS -D_LARGEFILE64_SOURCE -D_LARGEFILE_SOURCE -DQT_NO_DEBUG -DQT_CORE_LIB -I. -I../3rdparty/masm/jit -I../3rdparty/masm/assembler -I../3rdparty/masm/runtime -I../3rdparty/masm/wtf -I../3rdparty/masm/stubs -I../3rdparty/masm/stubs/wtf -I../3rdparty/masm -I../3rdparty/masm/disassembler -I../3rdparty/masm/disassembler/udis86 -I../qml/jsruntime -I. -I../qml/compiler -I. -I../qml/memory -I. -I../3rdparty/masm/jit -I../3rdparty/masm/assembler -I../3rdparty/masm/runtime -I../3rdparty/masm/wtf -I../3rdparty/masm/stubs -I../3rdparty/masm/stubs/wtf -I../3rdparty/masm -I../3rdparty/masm/disassembler -I../3rdparty/masm/disassembler/udis86 -I../qml/jit -I. -I.generated -I../../include -I/home/qt/tmp/src-5.9/qtbase/include -I../../include/QtQml -I../../include/QtQml/5.9.0 -I../../include/QtQml/5.9.0/QtQml -I/home/qt/tmp/src-5.9/qtbase/include/QtQml -I/home/qt/tmp/src-5.9/qtbase/include/QtCore/5.9.0 -I/home/qt/tmp/src-5.9/qtbase/include/QtCore/5.9.0/QtCore -I/home/qt/tmp/src-5.9/qtbase/include/QtCore -I.moc -I/home/qt/tmp/src-5.9/qtbase/mkspecs/linux-g++ -o .obj/qv4runtime.o ../qml/jsruntime/qv4runtime.cpp
      16:01:51 In file included from ../../include/QtQml/5.9.0/QtQml/private/qtqmlglobal_p.h:1:0,
      16:01:51                  from ../qml/jsruntime/qv4global_p.h:64,
      16:01:51                  from ../qml/jsruntime/qv4runtime.cpp:40:
      16:01:51 ../../include/QtQml/5.9.0/QtQml/private/../../../../../src/qml/qtqmlglobal_p.h:55:42: fatal error: QtQml/private/qtqml-config_p.h: No such file or directory
      16:01:51  #include <QtQml/private/qtqml-config_p.h>
      16:01:51                                           ^
      16:01:51 compilation terminated.
      16:01:51 Makefile:1764: recipe for target '.obj/qv4runtime.o' failed
      16:01:51 make[3]: *** [.obj/qv4runtime.o] Error 1
      16:01:51 make[3]: *** Waiting for unfinished jobs....
      16:01:53 make[3]: Leaving directory '/home/qt/tmp/src-5.9/qtdeclarative/src/qmldevtools'
      16:01:53 Makefile:354: recipe for target 'sub-qmldevtools-make_first-ordered' failed
      16:01:53 make[2]: *** [sub-qmldevtools-make_first-ordered] Error 2
      16:01:53 make[2]: Leaving directory '/home/qt/tmp/src-5.9/qtdeclarative/src'
      16:01:53 Makefile:48: recipe for target 'sub-src-make_first' failed
      16:01:53 make[1]: *** [sub-src-make_first] Error 2
      16:01:53 make[1]: Leaving directory '/home/qt/tmp/src-5.9/qtdeclarative'
      16:01:53 Makefile:360: recipe for target 'module-qtdeclarative-make_first' failed
      16:01:53 make: *** [module-qtdeclarative-make_first] Error 2
      

        Attachments

          Issue Links

          For Gerrit Dashboard: QTBUG-60675
          # Subject Branch Project Status CR V

            Activity

              People

              Assignee:
              buddenha Oswald Buddenhagen
              Reporter:
              joaijala Johanna Äijälä
              Votes:
              1 Vote for this issue
              Watchers:
              11 Start watching this issue

                Dates

                Created:
                Updated:
                Resolved:

                  Gerrit Reviews

                  There are no open Gerrit changes