Uploaded image for project: 'Qt'
  1. Qt
  2. QTBUG-60870

Qt5.9 Beta 4 does not compile

    XMLWordPrintable

    Details

      Description

      Configure options used (notice static build):

      -release -opensource -confirm-license -nomake examples -nomake tests -accessibility -no-sql-sqlite -no-qml-debug -qt-zlib -qt-libpng -qt-libjpeg -no-cups -qt-xcb -no-opengl -no-icu -no-libudev -qt-pcre -no-glib -no-egl -no-xinput2 -no-sm -static -openssl-linked -prefix /home/qtsupport/Qt/qtsdk/packaging-tools/qt-bld/qtbase

      Error:

      In file included from /home/qtsupport/Qt/qtsdk/packaging-tools/qt-src/qtdeclarative/include/QtQml/5.9.0/QtQml/private/qtqmlglobal_p.h:1:0,
                       from /home/qtsupport/Qt/qtsdk/packaging-tools/qt-src/qtdeclarative/src/qml/jsruntime/qv4global_p.h:64,
                       from /home/qtsupport/Qt/qtsdk/packaging-tools/qt-src/qtdeclarative/src/qml/jsruntime/qv4runtime.cpp:40:
      /home/qtsupport/Qt/qtsdk/packaging-tools/qt-src/qtdeclarative/include/QtQml/5.9.0/QtQml/private/../../../../../src/qml/qtqmlglobal_p.h:55:42: fatal error: QtQml/private/qtqml-config_p.h: No such file or directory
      compilation terminated.
      make[3]: *** [.obj/qv4runtime.o] Error 1
      make[3]: *** Waiting for unfinished jobs....
      In file included from /home/qtsupport/Qt/qtsdk/packaging-tools/qt-src/qtdeclarative/include/QtQml/5.9.0/QtQml/private/qtqmlglobal_p.h:1:0,
                       from /home/qtsupport/Qt/qtsdk/packaging-tools/qt-src/qtdeclarative/src/qml/jsruntime/qv4global_p.h:64,
                       from /home/qtsupport/Qt/qtsdk/packaging-tools/qt-src/qtdeclarative/src/qml/jsruntime/qv4managed_p.h:53,
                       from /home/qtsupport/Qt/qtsdk/packaging-tools/qt-src/qtdeclarative/src/qml/jsruntime/qv4string_p.h:54,
                       from /home/qtsupport/Qt/qtsdk/packaging-tools/qt-src/qtdeclarative/src/qml/jsruntime/qv4string.cpp:40:
      /home/qtsupport/Qt/qtsdk/packaging-tools/qt-src/qtdeclarative/include/QtQml/5.9.0/QtQml/private/../../../../../src/qml/qtqmlglobal_p.h:55:42: fatal error: QtQml/private/qtqml-config_p.h: No such file or directory
      compilation terminated.
      make[3]: *** [.obj/qv4string.o] Error 1
      In file included from /home/qtsupport/Qt/qtsdk/packaging-tools/qt-src/qtdeclarative/include/QtQml/5.9.0/QtQml/private/qtqmlglobal_p.h:1:0,
                       from /home/qtsupport/Qt/qtsdk/packaging-tools/qt-src/qtdeclarative/src/qml/jsruntime/qv4global_p.h:64,
                       from /home/qtsupport/Qt/qtsdk/packaging-tools/qt-src/qtdeclarative/src/qml/jsruntime/qv4engine_p.h:53,
                       from /home/qtsupport/Qt/qtsdk/packaging-tools/qt-src/qtdeclarative/src/qml/jsruntime/qv4value.cpp:39:
      /home/qtsupport/Qt/qtsdk/packaging-tools/qt-src/qtdeclarative/include/QtQml/5.9.0/QtQml/private/../../../../../src/qml/qtqmlglobal_p.h:55:42: fatal error: QtQml/private/qtqml-config_p.h: No such file or directory
      compilation terminated.
      make[3]: *** [.obj/qv4value.o] Error 1
      make[3]: Leaving directory `/home/qtsupport/Qt/qtsdk/packaging-tools/qt-bld/qtdeclarative/src/qmldevtools'
      make[2]: *** [sub-qmldevtools-make_first-ordered] Error 2
      make[2]: Leaving directory `/home/qtsupport/Qt/qtsdk/packaging-tools/qt-bld/qtdeclarative/src'
      make[1]: *** [sub-src-make_first] Error 2
      make[1]: Leaving directory `/home/qtsupport/Qt/qtsdk/packaging-tools/qt-bld/qtdeclarative'
      make: *** [module-qtdeclarative] Error 2
      Note, no output from the sub process!
            ERROR - ERROR - ERROR - ERROR - ERROR - ERROR !!!
            Executing:      [make -j9 module-qtbase module-qtdeclarative module-qttools module-qttranslations]
            Execution path: [/home/qtsupport/Qt/qtsdk/packaging-tools/qt-bld]
      Traceback (most recent call last):
        File "/home/qtsupport/Qt/qtsdk/packaging-tools/bldinstallercommon.py", line 744, in do_execute_sub_process
          raise Exception('*** Execution failed with code: {0}'.format(theproc.returncode))
      Exception: *** Execution failed with code: 2
      Traceback (most recent call last):
        File "bld_ifw_tools.py", line 673, in <module>
          build_ifw(OPTIONS, CARGS.create_installer)
        File "bld_ifw_tools.py", line 274, in build_ifw
          build_qt(options, options.qt_build_dir, options.qt_configure_options, options.qt_build_modules)
        File "bld_ifw_tools.py", line 355, in build_qt
          bldinstallercommon.do_execute_sub_process(cmd_args.split(' '), qt_build_dir, True, False, get_build_env(options.openssl_dir))
        File "/home/qtsupport/Qt/qtsdk/packaging-tools/bldinstallercommon.py", line 744, in do_execute_sub_process
          raise Exception('*** Execution failed with code: {0}'.format(theproc.returncode))
      Exception: *** Execution failed with code: 2
      
      

       

       

        Attachments

          Issue Links

          No reviews matched the request. Check your Options in the drop-down menu of this sections header.

            Activity

              People

              Assignee:
              buddenha Oswald Buddenhagen
              Reporter:
              kamartti Katja Marttila
              Votes:
              0 Vote for this issue
              Watchers:
              1 Start watching this issue

                Dates

                Created:
                Updated:
                Resolved:

                  Gerrit Reviews

                  There are no open Gerrit changes