Uploaded image for project: 'Qt'
  1. Qt
  2. QTBUG-65004

failed to build qtwebengine on QEMU (gcc-armv7) on Ubuntu_16_04

    XMLWordPrintable

    Details

    • Type: Bug
    • Status: Closed
    • Priority: P0: Blocker
    • Resolution: Done
    • Affects Version/s: 5.9.4
    • Fix Version/s: 5.9.4
    • Labels:
      None
    • Environment:
      Linux QEMU (gcc-armv7) on Linux Ubuntu_16_04 (gcc-x86_64) - Release, AbortTestingOnFirstFailure
    • Commits:
      f0c5f3306fadc7dea7a13defd8b9cf20a6982493

      Description

      https://codereview.qt-project.org/#/c/212586/ Merge remote-tracking branch 'origin/5.9.3' into 5.9
      https://codereview.qt-project.org/#/c/213559/ Update submodules on '5.9' in qt5
      and a few other changes in qt5

      https://testresults.qt.io/coin/integration/qt/qt5/tasks/1512542726
      https://testresults.qt.io/logs/qt/qtwebengine/a61648d44ba24b175055c408b9fc7a4c3952c0d2/LinuxUbuntu_16_04x86_64LinuxQEMUarmv7GCCqtci-linux-Ubuntu-16.04-x86_64-1-4ec73fRelease/57c898f5ba08e4c6d1da90dbf867023838af2247/build_1512545660/log.txt.gz

      [7857/17435] CXX v8_snapshot/obj/third_party/icu/bundled_icui18n/affixpatternparser.o
      FAILED: v8_snapshot/obj/third_party/icu/bundled_icui18n/affixpatternparser.o 
      /usr/bin/g++ -MMD -MF v8_snapshot/obj/third_party/icu/bundled_icui18n/affixpatternparser.o.d -DU_I18N_IMPLEMENTATION -DV8_DEPRECATION_WARNINGS -DUSE_UDEV -DUSE_AURA=1 -DUSE_NSS_CERTS=1 -DUSE_OZONE=1 -DNO_TCMALLOC -DDISABLE_NACL -DENABLE_TASK_MANAGER=1 -DENABLE_THEMES=1 -DFULL_SAFE_BROWSING -DSAFE_BROWSING_CSD -DSAFE_BROWSING_DB_LOCAL -DCHROMIUM_BUILD -DFIELDTRIAL_TESTING_ENABLED -DTOOLKIT_QT -D_FILE_OFFSET_BITS=64 -D_LARGEFILE_SOURCE -D_LARGEFILE64_SOURCE -DNDEBUG -DNVALGRIND -DDYNAMIC_ANNOTATIONS_ENABLED=0 -DHAVE_DLOPEN=0 -DUCONFIG_ONLY_HTML_CONVERSION=1 -DU_CHARSET_IS_UTF8=1 -DU_USING_ICU_NAMESPACE=0 -DU_ENABLE_DYLOAD=0 -DU_STATIC_IMPLEMENTATION -DICU_UTIL_DATA_IMPL=ICU_UTIL_DATA_FILE -Iv8_snapshot/gen -I../../3rdparty/chromium -I../../3rdparty/chromium/third_party/icu/source/common -I../../3rdparty/chromium/third_party/icu/source/i18n -Wno-deprecated-declarations -fno-strict-aliasing --param=ssp-buffer-size=4 -fstack-protector -funwind-tables -fPIC -pipe -pthread -m32 -msse2 -mfpmath=sse -mmmx -O2 -fno-ident -fdata-sections -ffunction-sections -g0 -fvisibility=hidden -Wno-unused-local-typedefs -Wno-maybe-uninitialized -Wno-missing-field-initializers -Wno-unused-parameter -Wno-unused-function -fno-threadsafe-statics -fvisibility-inlines-hidden -std=gnu++11 -fno-delete-null-pointer-checks -fno-exceptions -frtti -Wno-deprecated -Wno-narrowing -c ../../3rdparty/chromium/third_party/icu/source/i18n/affixpatternparser.cpp -o v8_snapshot/obj/third_party/icu/bundled_icui18n/affixpatternparser.o
      In file included from /usr/include/stdint.h:25:0,
                       from /usr/lib/gcc/x86_64-linux-gnu/5/include/stdint.h:9,
                       from ../../3rdparty/chromium/third_party/icu/source/common/unicode/ptypes.h:68,
                       from ../../3rdparty/chromium/third_party/icu/source/common/unicode/umachine.h:46,
                       from ../../3rdparty/chromium/third_party/icu/source/common/unicode/utypes.h:38,
                       from ../../3rdparty/chromium/third_party/icu/source/i18n/affixpatternparser.cpp:10:
      /usr/include/features.h:367:25: fatal error: sys/cdefs.h: No such file or directory
      compilation terminated.
      [7858/17435] CXX host/obj/third_party/protobuf/protoc_lib/zip_writer.o
      [7859/17435] CXX host/obj/third_party/protobuf/protoc_lib/plugin.o
      [7860/17435] CXX host/obj/third_party/protobuf/protoc_lib/ruby_generator.o
      [7861/17435] CXX host/obj/third_party/protobuf/protoc_lib/subprocess.o
      [7862/17435] CXX host/obj/third_party/protobuf/protoc_lib/plugin.pb.o
      [7863/17435] CXX host/obj/third_party/protobuf/protoc_lib/python_generator.o
      ninja: build stopped: subcommand failed.
      Makefile.gn_run:357: recipe for target 'run_ninja' failed
      make[3]: *** [run_ninja] Error 1
      make[3]: Leaving directory '/home/qt/work/qt/qtwebengine/src/core'
      Makefile:80: recipe for target 'sub-gn_run-pro-make_first' failed
      make[2]: *** [sub-gn_run-pro-make_first] Error 2
      make[2]: Leaving directory '/home/qt/work/qt/qtwebengine/src/core'
      Makefile:77: recipe for target 'sub-core-make_first' failed
      make[1]: *** [sub-core-make_first] Error 2
      make[1]: Leaving directory '/home/qt/work/qt/qtwebengine/src'
      Makefile:46: recipe for target 'sub-src-make_first' failed
      make: *** [sub-src-make_first] Error 2
      

        Attachments

        No reviews matched the request. Check your Options in the drop-down menu of this sections header.

          Activity

            People

            • Assignee:
              michal Michal Klocek
              Reporter:
              liaqi Liang Qi
            • Votes:
              0 Vote for this issue
              Watchers:
              6 Start watching this issue

              Dates

              • Created:
                Updated:
                Resolved:

                Gerrit Reviews

                There are no open Gerrit changes