Uploaded image for project: 'Qt'
  1. Qt
  2. QTBUG-67550

activeqt.qdocconf:15: (qdoc) error: Environment variable 'QT_INSTALL_HEADERS' undefined

    XMLWordPrintable

    Details

    • Type: Bug
    • Status: Closed
    • Priority: P0: Blocker
    • Resolution: Done
    • Affects Version/s: 5.12
    • Fix Version/s: 5.12.0 Alpha
    • Labels:
      None
    • Environment:
      Linux Ubuntu_16_04 (gcc-x86_64) - DeveloperBuild, OutOfSourceBuild, QtLibInfix, QtNamespace, BuildExamples, Documentation, AbortTestingOnFirstFailure
    • Commits:
      da9b8b60848afad84e4a9a8452480a88ab948bb8

      Description

      https://codereview.qt-project.org/#/c/225447/ Update submodules on 'dev' in qt5

      https://testresults.qt.io/coin/integration/qt/qt5/tasks/1523249248

      https://testresults.qt.io/coin/api/results/qt/qt5/a7ddbdda2613ff649348c93802df4053e56631d5/LinuxUbuntu_16_04x86_64LinuxUbuntu_16_04x86_64GCCqtci-linux-Ubuntu-16.04-x86_64-2-9d677aDeveloperBuild_OutOfSourceBuild_QtLibInfix_QtNamespace_BuildExamples_Documentation/2a48a3b7dcb9652b1532a3ad14de7580b5b9b1ee/build_1523249267/log.txt.gz

      /home/qt/work/build/qtactiveqt/src/activeqt/qdoc_wrapper.sh -outputdir /home/qt/work/build/qtbase/doc/activeqt -installdir /home/qt/work/build/qtbase/doc /home/qt/work/qt/qt5/qtactiveqt/src/activeqt/doc/activeqt.qdocconf -prepare -indexdir /home/qt/work/build/qtbase/doc -no-link-errors -I/home/qt/work/qt/qt5/qtactiveqt/src/activeqt -I. -I/home/qt/work/qt/qt5/qtbase/mkspecs/linux-g++
      /home/qt/work/qt/qt5/qtactiveqt/src/activeqt/doc/activeqt.qdocconf:15: (qdoc) error: Environment variable 'QT_INSTALL_HEADERS' undefined
      Environment variable 'QT_INSTALL_HEADERS' undefined
      
      Aborting
      Makefile:308: recipe for target 'prepare_docs' failed
      make[5]: *** [prepare_docs] Error 1
      make[5]: Leaving directory '/home/qt/work/build/qtactiveqt/src/activeqt'
      Makefile:312: recipe for target 'sub-activeqt-prepare_docs_ordered' failed
      make[4]: *** [sub-activeqt-prepare_docs_ordered] Error 2
      make[4]: Leaving directory '/home/qt/work/build/qtactiveqt/src'
      Makefile:297: recipe for target 'sub-src-prepare_docs' failed
      make[3]: *** [sub-src-prepare_docs] Error 2
      make[3]: Leaving directory '/home/qt/work/build/qtactiveqt'
      Makefile:2148: recipe for target 'module-qtactiveqt-prepare_docs' failed
      make[2]: *** [module-qtactiveqt-prepare_docs] Error 2
      make[2]: *** Waiting for unfinished jobs....

        Attachments

          Issue Links

          No reviews matched the request. Check your Options in the drop-down menu of this sections header.

            Activity

              People

              Assignee:
              liaqi Liang Qi
              Reporter:
              liaqi Liang Qi
              Votes:
              0 Vote for this issue
              Watchers:
              7 Start watching this issue

                Dates

                Created:
                Updated:
                Resolved:

                  Gerrit Reviews

                  There are no open Gerrit changes