Uploaded image for project: 'Qt'
  1. Qt
  2. QTBUG-70728

tools/gn/gn_main.obj : fatal error LNK1112: module machine type 'x86' conflicts with target machine type 'x64'

    XMLWordPrintable

    Details

    • Type: Bug
    • Status: Closed
    • Priority: P1: Critical
    • Resolution: Done
    • Affects Version/s: 5.12.0 Beta 1, 5.12.0 Beta 3
    • Fix Version/s: 5.12.0 RC
    • Labels:
      None
    • Platform/s:
      Windows

      Description

      https://codereview.qt-project.org/#/c/240252/ Update submodules on '5.12' in qt5 PS7

      https://testresults.qt.io/coin/integration/qt/qt5/tasks/1538112198

      https://testresults.qt.io/logs/qt/qtwebengine/66b4d0991627a3ab9eb2a87fd6cb3303e70974c9/WindowsWindows_10x86_64WindowsWindows_10x86MSVC2017qtci-windows-10-x86_64-10-2b65d8DebugAndRelease_Release_ForceDebugInfo_OpenGLDynamic/0d19242b78056bd7e3a5b39aed717ba6b132b680/build_1538116963/log.txt.gz

      agent:2018/09/25 08:29:32 build.go:193: [172/172] LINK gn.exe
      agent:2018/09/25 08:29:32 build.go:193: FAILED: gn.exe 
      agent:2018/09/25 08:29:32 build.go:193: ninja -t msvc -- link.exe /nologo /OUT:gn.exe /PDB:gn.exe.pdb @gn.exe.rsp
      agent:2018/09/25 08:29:32 build.go:193: tools/gn/gn_main.obj : fatal error LNK1112: module machine type 'x86' conflicts with target machine type 'x64'
      agent:2018/09/25 08:29:32 build.go:193: ninja: build stopped: subcommand failed.
      agent:2018/09/25 08:29:32 build.go:193: Project ERROR: GN build error!
      agent:2018/09/25 08:29:32 build.go:193: NMAKE : fatal error U1077: '(' : return code '0x3'
      agent:2018/09/25 08:29:32 build.go:193: Stop.
      agent:2018/09/25 08:29:32 build.go:193: NMAKE : fatal error U1077: 'cd' : return code '0x2'
      agent:2018/09/25 08:29:32 build.go:193: Stop.
      agent:2018/09/25 08:29:32 build.go:193: NMAKE : fatal error U1077: 'cd' : return code '0x2'
      agent:2018/09/25 08:29:32 build.go:193: Stop.
      agent:2018/09/25 08:29:32 build.go:237: Process finished with error: exit status 2
      agent:2018/09/25 08:29:32 build.go:435: Executing scheduled instruction 1 of 1 - Upload all core dumps if there are some
      agent:2018/09/25 08:29:32 build.go:196: Error reading from stdout/err: exit status 2
      agent:2018/09/25 08:29:32 build.go:437: 
      agent:2018/09/25 08:29:32 agent.go:198: Build failed
      agent:2018/09/25 08:29:32 agent.go:94: ERROR building: exit status 2

        Attachments

          Issue Links

          For Gerrit Dashboard: QTBUG-70728
          # Subject Branch Project Status CR V

            Activity

              People

              Assignee:
              tosaraja Tony Sarajärvi
              Reporter:
              liaqi Liang Qi
              Votes:
              0 Vote for this issue
              Watchers:
              8 Start watching this issue

                Dates

                Created:
                Updated:
                Resolved:

                  Gerrit Reviews

                  There are no open Gerrit changes