Uploaded image for project: 'Qt'
  1. Qt
  2. QTBUG-71141

qtdeclarative build failure: 'checkBlackLists': is not a member of 'QTestPrivate'

    XMLWordPrintable

    Details

    • Type: Bug
    • Status: Closed
    • Priority: P0: Blocker
    • Resolution: Done
    • Affects Version/s: 5.13
    • Fix Version/s: 5.13
    • Component/s: Testing: qtestlib
    • Labels:
      None
    • Platform/s:
      All
    • Commits:
      af6d4d068770db311e200c25513178b86bdf0e3b

      Description

      https://codereview.qt-project.org/#/c/242713/

      https://testresults.qt.io/coin/integration/qt/qt5/tasks/1540455217

      https://testresults.qt.io/logs/qt/qtdeclarative/7731dd7a8758488f94fcced6c912830839814a49/WindowsWindows_10x86_64WinRTWinRT_10armv7MSVC2015qtci-windows-10-x86_64-10-2b65d8DebugAndRelease_Release_ForceDebugInfo_DisableTests/2e777972c4d0a50ef4ee2111ad424e73927f4706/build_1540461370/log.txt.gz

      agent:2018/10/15 05:37:57 build.go:193: 	cl -c -FIQtQuickTestDepends -YuQtQuickTestDepends -Fp.pch\release\Qt5QuickTest_pch.pch -nologo -FS -FS -Zc:rvalueCast -Zc:inline -Zc:strictStrings -Zc:throwingNew -O2 -MD -Zi -utf-8 /wd4530 /wd4577 -GR -W3 -w34100 -w34189 -w44996 -w44456 -w44457 -w44458 -wd4577 -wd4467 /Fd.obj\release\Qt5QuickTest.vc.pdb -DUNICODE -DWIN32 -DQT_LARGEFILE_SUPPORT -DQ_BYTE_ORDER=Q_LITTLE_ENDIAN -D_ENABLE_EXTENDED_ALIGNED_STORAGE -DWINAPI_FAMILY=WINAPI_FAMILY_PC_APP -DWINAPI_PARTITION_PHONE_APP=1 -DARM -D__ARM__ -D__arm__ -DQT_NO_URL_CAST_FROM_STRING -DQT_NO_FOREACH -DQT_QMLTEST_WITH_WIDGETS -DQT_QML_DEBUG_NO_WARNING -DQT_NO_NARROWING_CONVERSIONS_IN_CONNECT -DQT_BUILD_QMLTEST_LIB -DQT_BUILDING_QT -D_CRT_SECURE_NO_WARNINGS -D_USE_MATH_DEFINES -DQT_NO_CAST_TO_ASCII -DQT_ASCII_CAST_WARNINGS -DQT_MOC_COMPAT -DQT_USE_QSTRINGBUILDER -DQT_DEPRECATED_WARNINGS -DQT_DISABLE_DEPRECATED_BEFORE=0x040800 -DQT_NO_EXCEPTIONS -DQT_NO_DEBUG -DQT_TESTLIB_LIB -DQT_WIDGETS_LIB -DQT_GUI_LIB -DQT_CORE_LIB -DQT_QUICK_LIB -DQT_QML_LIB -DQT_GUI_LIB -DQT_NETWORK_LIB -DQT_CORE_LIB -DQT_TESTCASE_BUILDDIR="\"C:/Users/qt/work/qt/qtdeclarative/src/qmltest\"" -DNDEBUG -D_WINDLL -I. -I..\..\include -I..\..\include\QtQuickTest -I..\..\include\QtQuickTest\5.13.0 -I..\..\include\QtQuickTest\5.13.0\QtQuickTest -Itmp -Ic:\Users\qt\work\install\include\QtTest\5.13.0 -Ic:\Users\qt\work\install\include\QtTest\5.13.0\QtTest -Ic:\Users\qt\work\install\include\QtCore\5.13.0 -Ic:\Users\qt\work\install\include\QtCore\5.13.0\QtCore -Ic:\Users\qt\work\install\include -Ic:\Users\qt\work\install\include\QtTest -Ic:\Users\qt\work\install\include\QtWidgets -Ic:\Users\qt\work\install\include\QtGui -Ic:\Users\qt\work\install\include\QtANGLE -Ic:\Users\qt\work\install\include\QtCore -I..\..\include\QtQuick -I..\..\include\QtQml\5.13.0 -I..\..\include\QtQml\5.13.0\QtQml -I..\..\include\QtQml -Ic:\Users\qt\work\install\include\QtGui\5.13.0 -Ic:\Users\qt\work\install\include\QtGui\5.13.0\QtGui -Ic:\Users\qt\work\install\include\QtNetwork -I.moc\release -Ic:\Users\qt\work\install\mkspecs\winrt-arm-msvc2015 -Fo.obj\release\ @C:\Users\qt\AppData\Local\Temp\quicktestresult.obj.4500.10640.jom
      agent:2018/10/15 05:37:57 build.go:193: quicktestresult.cpp
      agent:2018/10/15 05:37:57 build.go:193: quicktestresult.cpp(265): error C2039: 'checkBlackLists': is not a member of 'QTestPrivate'
      agent:2018/10/15 05:37:57 build.go:193: c:\Users\qt\work\install\include\QtTest\5.13.0\QtTest/private/qtestblacklist_p.h(58): note: see declaration of 'QTestPrivate'
      agent:2018/10/15 05:37:57 build.go:193: quicktestresult.cpp(265): error C3861: 'checkBlackLists': identifier not found
      agent:2018/10/15 05:37:57 build.go:193: quicktestresult.cpp(294): error C2039: 'checkBlackLists': is not a member of 'QTestPrivate'
      agent:2018/10/15 05:37:57 build.go:193: c:\Users\qt\work\install\include\QtTest\5.13.0\QtTest/private/qtestblacklist_p.h(58): note: see declaration of 'QTestPrivate'
      agent:2018/10/15 05:37:57 build.go:193: quicktestresult.cpp(294): error C3861: 'checkBlackLists': identifier not found
      agent:2018/10/15 05:37:59 build.go:193: 	C:\Utils\Jom\jom.exe -f Makefile.Debug all
      agent:2018/10/15 05:37:59 build.go:193: jom: C:\Users\qt\work\qt\qtdeclarative\src\qmltest\Makefile.Debug [.obj\debug\quicktestresult.obj] Error 2
      

        Attachments

        No reviews matched the request. Check your Options in the drop-down menu of this sections header.

          Activity

            People

            Assignee:
            liaqi Liang Qi
            Reporter:
            liaqi Liang Qi
            Votes:
            1 Vote for this issue
            Watchers:
            2 Start watching this issue

              Dates

              Created:
              Updated:
              Resolved:

                Gerrit Reviews

                There are no open Gerrit changes