Uploaded image for project: 'Qt'
  1. Qt
  2. QTBUG-71313

Building for iOS-simulator fails with Xcode 10.0

    XMLWordPrintable

    Details

    • Platform/s:
      iOS/tvOS/watchOS

      Description

      Steps to reproduce:
      1. Install 5.9.7 iOS binary from staging (tested with commercial license)
      2. Launch Qt Creator
      3. Open any example (chip used) and build it

      Expected result:
      The example build without problems

      Actual result:

      __ZL16qt_message_print9QtMsgTypeRK18QMessageLogContextRK7QString for architecture x86_64clang: error: linker command failed with exit code 1 (use -v to see invocation)
      ** BUILD FAILED **
      
      The following build commands failed:	Ld .xcode/chip.build/Release-iphonesimulator/chip.build/Objects-normal/x86_64/chip normal x86_64(1 failure)make: *** [xcodebuild-release-simulator] Error 6512:19:03: The process "/usr/bin/make" exited with code 2.Error while building/deploying project chip (kit: Qt 5.9.7 for iOS Simulator)When executing step "Make"12:19:03: Elapsed time: 00:13.

      from Compile Output shown.

        Attachments

          Issue Links

          No reviews matched the request. Check your Options in the drop-down menu of this sections header.

            Activity

              People

              Assignee:
              buddenha Oswald Buddenhagen
              Reporter:
              mipohjan Milla Pohjanheimo
              Votes:
              0 Vote for this issue
              Watchers:
              5 Start watching this issue

                Dates

                Created:
                Updated:
                Resolved:

                  Gerrit Reviews

                  There are no open Gerrit changes