Uploaded image for project: 'Qt'
  1. Qt
  2. QTBUG-71804

'GLsizeiptr' and 'GLintptr': redefinition; different basic types

    XMLWordPrintable

    Details

    • Type: Bug
    • Status: Closed
    • Priority: P0: Blocker
    • Resolution: Done
    • Affects Version/s: 5.13.0 Alpha 1
    • Fix Version/s: None
    • Component/s: WebEngine
    • Labels:
      None
    • Platform/s:
      Windows

      Description

      https://codereview.qt-project.org/#/c/174916/ Update submodules on 'dev' in qt5

      https://testresults.qt.io/coin/integration/qt/qt5/tasks/1543890606

      https://testresults.qt.io/coin/api/results/qt/qtwebengine/23183b1e96d18a2e8dfee0b1f46d7b146097cbd5/WindowsWindows_10x86_64WindowsWindows_10x86MSVC2017qtci-windows-10-x86_64-10-48c257DebugAndRelease_Release_ForceDebugInfo_OpenGLDynamic/7cec9e06ad461549fa35a44b64c7d31b8a427ca0/build_1543895617/log.txt.gz

      agent:2018/11/13 18:15:26 build.go:193: c:\Users\qt\work\install\include\QtGui/qopenglext.h(472): error C2371: 'GLsizeiptr': redefinition; different basic types
      agent:2018/11/13 18:15:26 build.go:193: C:\Users\qt\work\qt\qtwebengine\src\3rdparty\chromium\gpu/command_buffer/common/gl2_types.h(30): note: see declaration of 'GLsizeiptr'
      agent:2018/11/13 18:15:26 build.go:193: c:\Users\qt\work\install\include\QtGui/qopenglext.h(473): error C2371: 'GLintptr': redefinition; different basic types
      agent:2018/11/13 18:15:26 build.go:193: C:\Users\qt\work\qt\qtwebengine\src\3rdparty\chromium\gpu/command_buffer/common/gl2_types.h(29): note: see declaration of 'GLintptr'
      agent:2018/11/13 18:15:26 build.go:193: [23055/23137] CXX obj/QtWebEngineCore/service_qt.obj
      agent:2018/11/13 18:15:26 build.go:193: cl : Command line warning D9025 : overriding '/O1' with '/O2'
      agent:2018/11/13 18:15:26 build.go:193: cl : Command line warning D9025 : overriding '/W4' with '/W3'
      agent:2018/11/13 18:15:27 build.go:193: [23056/23137] CXX obj/QtWebEngineCore/web_engine_error.obj
      agent:2018/11/13 18:15:27 build.go:193: cl : Command line warning D9025 : overriding '/O1' with '/O2'
      agent:2018/11/13 18:15:27 build.go:193: cl : Command line warning D9025 : overriding '/W4' with '/W3'
      agent:2018/11/13 18:15:32 build.go:193: [23057/23137] CXX obj/QtWebEngineCore/render_view_observer_host_qt.obj
      agent:2018/11/13 18:15:32 build.go:193: cl : Command line warning D9025 : overriding '/O1' with '/O2'
      agent:2018/11/13 18:15:32 build.go:193: cl : Command line warning D9025 : overriding '/W4' with '/W3'
      agent:2018/11/13 18:15:32 build.go:193: [23058/23137] CXX obj/QtWebEngineCore/javascript_dialog_manager_qt.obj
      agent:2018/11/13 18:15:32 build.go:193: cl : Command line warning D9025 : overriding '/O1' with '/O2'
      agent:2018/11/13 18:15:32 build.go:193: cl : Command line warning D9025 : overriding '/W4' with '/W3'
      agent:2018/11/13 18:15:33 build.go:193: [23059/23137] CXX obj/QtWebEngineCore/resource_context_qt.obj
      agent:2018/11/13 18:15:33 build.go:193: cl : Command line warning D9025 : overriding '/O1' with '/O2'
      agent:2018/11/13 18:15:33 build.go:193: cl : Command line warning D9025 : overriding '/W4' with '/W3'
      agent:2018/11/13 18:15:36 build.go:193: [23060/23137] CXX obj/QtWebEngineCore/login_delegate_qt.obj
      agent:2018/11/13 18:15:36 build.go:193: cl : Command line warning D9025 : overriding '/O1' with '/O2'
      agent:2018/11/13 18:15:36 build.go:193: cl : Command line warning D9025 : overriding '/W4' with '/W3'
      agent:2018/11/13 18:15:41 build.go:193: [23061/23137] CXX obj/QtWebEngineCore/content_renderer_client_qt.obj
      agent:2018/11/13 18:15:41 build.go:193: cl : Command line warning D9025 : overriding '/O1' with '/O2'
      agent:2018/11/13 18:15:41 build.go:193: cl : Command line warning D9025 : overriding '/W4' with '/W3'
      agent:2018/11/13 18:15:41 build.go:193: C:/Users/qt/work/qt/qtwebengine/src/core/renderer/content_renderer_client_qt.cpp(216): warning C4138: '*/' found outside of comment
      agent:2018/11/13 18:15:41 build.go:193: C:/Users/qt/work/qt/qtwebengine/src/core/renderer/content_renderer_client_qt.cpp(455): warning C4189: 'cdm_supports_persistent_license': local variable is initialized but not referenced
      agent:2018/11/13 18:15:41 build.go:193: C:/Users/qt/work/qt/qtwebengine/src/core/renderer/content_renderer_client_qt.cpp(427): warning C4189: 'supported_codecs': local variable is initialized but not referenced
      agent:2018/11/13 18:15:42 build.go:193: [23062/23137] CXX obj/QtWebEngineCore/visited_links_manager_qt.obj
      agent:2018/11/13 18:15:42 build.go:193: cl : Command line warning D9025 : overriding '/O1' with '/O2'
      agent:2018/11/13 18:15:42 build.go:193: cl : Command line warning D9025 : overriding '/W4' with '/W3'
      agent:2018/11/13 18:15:42 build.go:193: [23063/23137] CXX obj/QtWebEngineCore/profile_io_data_qt.obj
      agent:2018/11/13 18:15:42 build.go:193: cl : Command line warning D9025 : overriding '/O1' with '/O2'
      agent:2018/11/13 18:15:42 build.go:193: cl : Command line warning D9025 : overriding '/W4' with '/W3'
      agent:2018/11/13 18:15:46 build.go:193: [23064/23137] CXX obj/QtWebEngineCore/media_capture_devices_dispatcher.obj
      agent:2018/11/13 18:15:46 build.go:193: cl : Command line warning D9025 : overriding '/O1' with '/O2'
      agent:2018/11/13 18:15:46 build.go:193: cl : Command line warning D9025 : overriding '/W4' with '/W3'
      agent:2018/11/13 18:15:52 build.go:193: [23065/23137] CXX obj/QtWebEngineCore/quota_permission_context_qt.obj
      agent:2018/11/13 18:15:52 build.go:193: cl : Command line warning D9025 : overriding '/O1' with '/O2'
      agent:2018/11/13 18:15:52 build.go:193: cl : Command line warning D9025 : overriding '/W4' with '/W3'
      agent:2018/11/13 18:16:01 build.go:193: [23066/23137] CXX obj/QtWebEngineCore/permission_manager_qt.obj
      agent:2018/11/13 18:16:01 build.go:193: cl : Command line warning D9025 : overriding '/O1' with '/O2'
      agent:2018/11/13 18:16:01 build.go:193: cl : Command line warning D9025 : overriding '/W4' with '/W3'
      agent:2018/11/13 18:16:04 build.go:193: [23067/23137] CXX obj/QtWebEngineCore/profile_adapter.obj
      agent:2018/11/13 18:16:04 build.go:193: cl : Command line warning D9025 : overriding '/O1' with '/O2'
      agent:2018/11/13 18:16:04 build.go:193: cl : Command line warning D9025 : overriding '/W4' with '/W3'
      agent:2018/11/13 18:16:09 build.go:193: [23068/23137] CXX obj/QtWebEngineCore/render_widget_host_view_qt.obj
      agent:2018/11/13 18:16:09 build.go:193: cl : Command line warning D9025 : overriding '/O1' with '/O2'
      agent:2018/11/13 18:16:09 build.go:193: cl : Command line warning D9025 : overriding '/W4' with '/W3'
      agent:2018/11/13 18:16:21 build.go:193: [23069/23137] CXX obj/QtWebEngineCore/web_contents_adapter.obj
      agent:2018/11/13 18:16:21 build.go:193: cl : Command line warning D9025 : overriding '/O1' with '/O2'
      agent:2018/11/13 18:16:21 build.go:193: cl : Command line warning D9025 : overriding '/W4' with '/W3'
      agent:2018/11/13 18:16:21 build.go:193: C:/Users/qt/work/qt/qtwebengine/src/core/web_contents_adapter.cpp(538): warning C4003: not enough actual parameters for macro 'CHECK_INITIALIZED'
      agent:2018/11/13 18:16:21 build.go:193: C:/Users/qt/work/qt/qtwebengine/src/core/web_contents_adapter.cpp(551): warning C4003: not enough actual parameters for macro 'CHECK_INITIALIZED'
      agent:2018/11/13 18:16:21 build.go:193: C:/Users/qt/work/qt/qtwebengine/src/core/web_contents_adapter.cpp(559): warning C4003: not enough actual parameters for macro 'CHECK_INITIALIZED'
      agent:2018/11/13 18:16:21 build.go:193: C:/Users/qt/work/qt/qtwebengine/src/core/web_contents_adapter.cpp(706): warning C4003: not enough actual parameters for macro 'CHECK_INITIALIZED'
      agent:2018/11/13 18:16:21 build.go:193: C:/Users/qt/work/qt/qtwebengine/src/core/web_contents_adapter.cpp(760): warning C4003: not enough actual parameters for macro 'CHECK_INITIALIZED'
      agent:2018/11/13 18:16:21 build.go:193: C:/Users/qt/work/qt/qtwebengine/src/core/web_contents_adapter.cpp(766): warning C4003: not enough actual parameters for macro 'CHECK_INITIALIZED'
      agent:2018/11/13 18:16:21 build.go:193: C:/Users/qt/work/qt/qtwebengine/src/core/web_contents_adapter.cpp(772): warning C4003: not enough actual parameters for macro 'CHECK_INITIALIZED'
      agent:2018/11/13 18:16:21 build.go:193: C:/Users/qt/work/qt/qtwebengine/src/core/web_contents_adapter.cpp(778): warning C4003: not enough actual parameters for macro 'CHECK_INITIALIZED'
      agent:2018/11/13 18:16:21 build.go:193: C:/Users/qt/work/qt/qtwebengine/src/core/web_contents_adapter.cpp(784): warning C4003: not enough actual parameters for macro 'CHECK_INITIALIZED'
      agent:2018/11/13 18:16:21 build.go:193: C:/Users/qt/work/qt/qtwebengine/src/core/web_contents_adapter.cpp(790): warning C4003: not enough actual parameters for macro 'CHECK_INITIALIZED'
      agent:2018/11/13 18:16:21 build.go:193: C:/Users/qt/work/qt/qtwebengine/src/core/web_contents_adapter.cpp(796): warning C4003: not enough actual parameters for macro 'CHECK_INITIALIZED'
      agent:2018/11/13 18:16:21 build.go:193: C:/Users/qt/work/qt/qtwebengine/src/core/web_contents_adapter.cpp(802): warning C4003: not enough actual parameters for macro 'CHECK_INITIALIZED'
      agent:2018/11/13 18:16:21 build.go:193: C:/Users/qt/work/qt/qtwebengine/src/core/web_contents_adapter.cpp(808): warning C4003: not enough actual parameters for macro 'CHECK_INITIALIZED'
      agent:2018/11/13 18:16:21 build.go:193: C:/Users/qt/work/qt/qtwebengine/src/core/web_contents_adapter.cpp(814): warning C4003: not enough actual parameters for macro 'CHECK_INITIALIZED'
      agent:2018/11/13 18:16:21 build.go:193: C:/Users/qt/work/qt/qtwebengine/src/core/web_contents_adapter.cpp(822): warning C4003: not enough actual parameters for macro 'CHECK_INITIALIZED'
      agent:2018/11/13 18:16:21 build.go:193: C:/Users/qt/work/qt/qtwebengine/src/core/web_contents_adapter.cpp(880): warning C4003: not enough actual parameters for macro 'CHECK_INITIALIZED'
      agent:2018/11/13 18:16:21 build.go:193: C:/Users/qt/work/qt/qtwebengine/src/core/web_contents_adapter.cpp(887): warning C4003: not enough actual parameters for macro 'CHECK_INITIALIZED'
      agent:2018/11/13 18:16:21 build.go:193: C:/Users/qt/work/qt/qtwebengine/src/core/web_contents_adapter.cpp(893): warning C4003: not enough actual parameters for macro 'CHECK_INITIALIZED'
      agent:2018/11/13 18:16:21 build.go:193: C:/Users/qt/work/qt/qtwebengine/src/core/web_contents_adapter.cpp(942): warning C4003: not enough actual parameters for macro 'CHECK_INITIALIZED'
      agent:2018/11/13 18:16:21 build.go:193: C:/Users/qt/work/qt/qtwebengine/src/core/web_contents_adapter.cpp(1009): warning C4003: not enough actual parameters for macro 'CHECK_INITIALIZED'
      agent:2018/11/13 18:16:21 build.go:193: C:/Users/qt/work/qt/qtwebengine/src/core/web_contents_adapter.cpp(1016): warning C4003: not enough actual parameters for macro 'CHECK_INITIALIZED'
      agent:2018/11/13 18:16:21 build.go:193: C:/Users/qt/work/qt/qtwebengine/src/core/web_contents_adapter.cpp(1033): warning C4003: not enough actual parameters for macro 'CHECK_INITIALIZED'
      agent:2018/11/13 18:16:21 build.go:193: C:/Users/qt/work/qt/qtwebengine/src/core/web_contents_adapter.cpp(1087): warning C4003: not enough actual parameters for macro 'CHECK_INITIALIZED'
      agent:2018/11/13 18:16:21 build.go:193: C:/Users/qt/work/qt/qtwebengine/src/core/web_contents_adapter.cpp(1099): warning C4003: not enough actual parameters for macro 'CHECK_INITIALIZED'
      agent:2018/11/13 18:16:21 build.go:193: C:/Users/qt/work/qt/qtwebengine/src/core/web_contents_adapter.cpp(1111): warning C4003: not enough actual parameters for macro 'CHECK_INITIALIZED'
      agent:2018/11/13 18:16:21 build.go:193: C:/Users/qt/work/qt/qtwebengine/src/core/web_contents_adapter.cpp(1170): warning C4003: not enough actual parameters for macro 'CHECK_INITIALIZED'
      agent:2018/11/13 18:16:21 build.go:193: C:/Users/qt/work/qt/qtwebengine/src/core/web_contents_adapter.cpp(1176): warning C4003: not enough actual parameters for macro 'CHECK_INITIALIZED'
      agent:2018/11/13 18:16:21 build.go:193: C:/Users/qt/work/qt/qtwebengine/src/core/web_contents_adapter.cpp(1182): warning C4003: not enough actual parameters for macro 'CHECK_INITIALIZED'
      agent:2018/11/13 18:16:21 build.go:193: C:/Users/qt/work/qt/qtwebengine/src/core/web_contents_adapter.cpp(1188): warning C4003: not enough actual parameters for macro 'CHECK_INITIALIZED'
      agent:2018/11/13 18:16:21 build.go:193: C:/Users/qt/work/qt/qtwebengine/src/core/web_contents_adapter.cpp(1195): warning C4003: not enough actual parameters for macro 'CHECK_INITIALIZED'
      agent:2018/11/13 18:16:21 build.go:193: C:/Users/qt/work/qt/qtwebengine/src/core/web_contents_adapter.cpp(1245): warning C4003: not enough actual parameters for macro 'CHECK_INITIALIZED'
      agent:2018/11/13 18:16:21 build.go:193: C:/Users/qt/work/qt/qtwebengine/src/core/web_contents_adapter.cpp(1256): warning C4003: not enough actual parameters for macro 'CHECK_INITIALIZED'
      agent:2018/11/13 18:16:21 build.go:193: C:/Users/qt/work/qt/qtwebengine/src/core/web_contents_adapter.cpp(1262): warning C4003: not enough actual parameters for macro 'CHECK_INITIALIZED'
      agent:2018/11/13 18:16:21 build.go:193: C:/Users/qt/work/qt/qtwebengine/src/core/web_contents_adapter.cpp(1276): warning C4003: not enough actual parameters for macro 'CHECK_INITIALIZED'
      agent:2018/11/13 18:16:21 build.go:193: C:/Users/qt/work/qt/qtwebengine/src/core/web_contents_adapter.cpp(1286): warning C4003: not enough actual parameters for macro 'CHECK_INITIALIZED'
      agent:2018/11/13 18:16:21 build.go:193: C:/Users/qt/work/qt/qtwebengine/src/core/web_contents_adapter.cpp(1304): warning C4003: not enough actual parameters for macro 'CHECK_INITIALIZED'
      agent:2018/11/13 18:16:21 build.go:193: C:/Users/qt/work/qt/qtwebengine/src/core/web_contents_adapter.cpp(1362): warning C4003: not enough actual parameters for macro 'CHECK_INITIALIZED'
      agent:2018/11/13 18:16:21 build.go:193: C:/Users/qt/work/qt/qtwebengine/src/core/web_contents_adapter.cpp(1504): warning C4003: not enough actual parameters for macro 'CHECK_INITIALIZED'
      agent:2018/11/13 18:16:21 build.go:193: C:/Users/qt/work/qt/qtwebengine/src/core/web_contents_adapter.cpp(1533): warning C4003: not enough actual parameters for macro 'CHECK_INITIALIZED'
      agent:2018/11/13 18:16:21 build.go:193: C:/Users/qt/work/qt/qtwebengine/src/core/web_contents_adapter.cpp(1555): warning C4003: not enough actual parameters for macro 'CHECK_INITIALIZED'
      agent:2018/11/13 18:16:21 build.go:193: C:/Users/qt/work/qt/qtwebengine/src/core/web_contents_adapter.cpp(1562): warning C4003: not enough actual parameters for macro 'CHECK_INITIALIZED'
      agent:2018/11/13 18:16:21 build.go:193: C:/Users/qt/work/qt/qtwebengine/src/core/web_contents_adapter.cpp(1575): warning C4003: not enough actual parameters for macro 'CHECK_INITIALIZED'
      agent:2018/11/13 18:16:21 build.go:193: C:/Users/qt/work/qt/qtwebengine/src/core/web_contents_adapter.cpp(1585): warning C4003: not enough actual parameters for macro 'CHECK_INITIALIZED'
      agent:2018/11/13 18:16:21 build.go:193: C:/Users/qt/work/qt/qtwebengine/src/core/web_contents_adapter.cpp(1592): warning C4003: not enough actual parameters for macro 'CHECK_INITIALIZED'
      agent:2018/11/13 18:16:21 build.go:193: C:/Users/qt/work/qt/qtwebengine/src/core/web_contents_adapter.cpp(1645): warning C4003: not enough actual parameters for macro 'CHECK_INITIALIZED'
      agent:2018/11/13 18:16:21 build.go:193: ninja: build stopped: subcommand failed.
      agent:2018/11/13 18:16:21 build.go:193: NMAKE : fatal error U1077: 'C:\Users\qt\work\qt\qtwebengine\src\3rdparty\ninja\ninja.exe' : return code '0x1'
      agent:2018/11/13 18:16:21 build.go:193: Stop.
      agent:2018/11/13 18:16:21 build.go:193: NMAKE : fatal error U1077: '"C:\Program Files (x86)\Microsoft Visual Studio\2017\Professional\VC\Tools\MSVC\14.11.25503\bin\HostX64\x64\nmake.exe"' : return code '0x2'
      agent:2018/11/13 18:16:21 build.go:193: Stop.
      agent:2018/11/13 18:16:21 build.go:193: NMAKE : fatal error U1077: '(' : return code '0x2'
      agent:2018/11/13 18:16:21 build.go:193: Stop.
      agent:2018/11/13 18:16:21 build.go:193: NMAKE : fatal error U1077: 'cd' : return code '0x2'
      agent:2018/11/13 18:16:21 build.go:193: Stop.
      agent:2018/11/13 18:16:21 build.go:193: NMAKE : fatal error U1077: 'cd' : return code '0x2'
      agent:2018/11/13 18:16:21 build.go:193: Stop.
      agent:2018/11/13 18:16:21 build.go:237: Process finished with error: exit status 2
      agent:2018/11/13 18:16:21 build.go:196: Error reading from stdout/err: exit status 2
      agent:2018/11/13 18:16:21 build.go:435: Executing scheduled instruction 1 of 1 - Upload all core dumps if there are some
      agent:2018/11/13 18:16:21 build.go:437: 
      agent:2018/11/13 18:16:21 agent.go:198: Build failed
      agent:2018/11/13 18:16:21 agent.go:94: ERROR building: exit status 2
      

        Attachments

          Issue Links

          No reviews matched the request. Check your Options in the drop-down menu of this sections header.

            Activity

              People

              Assignee:
              allan.jensen Allan Sandfeld Jensen
              Reporter:
              liaqi Liang Qi
              Votes:
              0 Vote for this issue
              Watchers:
              5 Start watching this issue

                Dates

                Created:
                Updated:
                Resolved:

                  Gerrit Reviews

                  There are no open Gerrit changes