Uploaded image for project: 'Qt'
  1. Qt
  2. QTBUG-74340

Undefined symbols for architecture x86_64: QStringView::toWCharArray(wchar_t*) const

    XMLWordPrintable

    Details

    • Platform/s:
      Android, iOS/tvOS/watchOS, Linux/Other display system, QNX
    • Commits:
      29a70348d4ed4f5acca82bfb9f73a1acf06c3aa8 (qt/qtbase/dev)

      Description

      https://codereview.qt-project.org/#/c/254963/ Update submodules on 'dev' in qt5

      https://testresults.qt.io/coin/integration/qt/qt5/tasks/1552370336

      https://testresults.qt.io/coin/api/results/qt/qtdeclarative/d16c5065bcb48aa992278cd10431a5d6467b7a24/MacOSMacOS_10_13x86_64AndroidAndroid_ANYarmv7Clangqtci-macos-10.13-x86_64-2-ce09bfDisableTests_OpenGLES2_Release/adafb4edb9e6b5384c0c0993cf48a363fbe5bcd5/build_1552370533/log.txt.gz

      agent:2019/03/12 06:10:07 build.go:197: /Applications/Xcode10.app/Contents/Developer/Toolchains/XcodeDefault.xctoolchain/usr/bin/clang++ -stdlib=libc++ -headerpad_max_install_names  -arch x86_64 -Wl,-syslibroot,/Applications/Xcode10.app/Contents/Developer/Platforms/MacOSX.platform/Developer/SDKs/MacOSX10.14.sdk -mmacosx-version-min=10.12 -Wl,-dead_strip -Wl,-rpath,@executable_path/../Frameworks -o ../../bin/qmlimportscanner .obj/main.o   -L/Users/qt/work/qt/qtdeclarative/lib -lQt5QmlDevTools -L/Users/qt/work/install/lib -lQt5Bootstrap -framework Foundation -framework CoreServices   
      agent:2019/03/12 06:10:07 build.go:197: Undefined symbols for architecture x86_64:
      agent:2019/03/12 06:10:07 build.go:197:   "QStringView::toWCharArray(wchar_t*) const", referenced from:
      agent:2019/03/12 06:10:07 build.go:197:       _main in main.o
      agent:2019/03/12 06:10:07 build.go:197: ld: symbol(s) not found for architecture x86_64
      agent:2019/03/12 06:10:07 build.go:197: clang: error: linker command failed with exit code 1 (use -v to see invocation)
      agent:2019/03/12 06:10:07 build.go:197: make[2]: *** [../../bin/qmlimportscanner] Error 1
      agent:2019/03/12 06:10:07 build.go:197: make[1]: *** [sub-qmlimportscanner-make_first] Error 2
      agent:2019/03/12 06:10:07 build.go:197: make: *** [sub-tools-make_first] Error 2
      

        Attachments

          Issue Links

          No reviews matched the request. Check your Options in the drop-down menu of this sections header.

            Activity

              People

              Assignee:
              liaqi Liang Qi
              Reporter:
              liaqi Liang Qi
              Votes:
              0 Vote for this issue
              Watchers:
              9 Start watching this issue

                Dates

                Created:
                Updated:
                Resolved:

                  Gerrit Reviews

                  There are no open Gerrit changes