Uploaded image for project: 'Qt'
  1. Qt
  2. QTBUG-75815

Tests are crashing in Windows 7 and openssl 1.1.1b in multiple Modules

    XMLWordPrintable

    Details

    • Platform/s:
      Windows

      Description

      Windows 7 tests are crashing in multiple different modules. These are blocking 5.13.0 and OpenSSL 1.1.1b update

      Remote Objects and XMLPatterns Logs attached!

      http://10.212.0.61:8083/coin/integration/qt/qt5/tasks/web_qt_qt5_1557812571404

      QtBase:

      agent:2019/05/14 06:27:32 build.go:197: A crash occurred in C:\Users\qt\work\qt\qtbase\tests\auto\network\access\qhttpnetworkconnection\release\tst_qhttpnetworkconnection.exe.
      agent:2019/05/14 06:27:32 build.go:197: Function time: 5ms Total time: 11872ms
      agent:2019/05/14 06:27:32 build.go:197: 
      agent:2019/05/14 06:27:32 build.go:197: Exception address: 0x7719289e
      agent:2019/05/14 06:27:32 build.go:197: Exception code : 0xc0000005
      agent:2019/05/14 06:27:32 build.go:197: Nearby symbol : RtlFreeHeap
      agent:2019/05/14 06:27:32 build.go:197: 
      agent:2019/05/14 06:27:32 build.go:197: Stack:
      agent:2019/05/14 06:27:32 build.go:197: # 1: ZN5QTest15toPrettyUnicodeEPKti() - 0x6efc2700
      agent:2019/05/14 06:27:32 build.go:197: # 2: UnhandledExceptionFilter() - 0x753f08c1
      agent:2019/05/14 06:27:32 build.go:197: # 3: EtwReplyNotification() - 0x771b75d4
      agent:2019/05/14 06:27:32 build.go:197: # 4: RtlInitializeExceptionChain() - 0x771a358b
      agent:2019/05/14 06:27:32 build.go:197: 
      agent:2019/05/14 06:27:32 build.go:197: Mingw32-make[1]: *** [Makefile.Release:84: check] Error -1073741819
      agent:2019/05/14 06:27:32 build.go:197: Mingw32-make[1]: Leaving directory 'C:/Users/qt/work/qt/qtbase/tests/auto/network/access/qhttpnetworkconnection'
      agent:2019/05/14 06:27:32 build.go:197: Mingw32-make: *** [Makefile:246: release-check] Error 2
      agent:2019/05/14 06:27:32 build.go:230: Process finished with error: exit status 2
      agent:2019/05/14 06:27:32 build.go:200: Error reading from stdout/err: exit status 2
      agent:2019/05/14 06:27:32 build.go:783: 
      agent:2019/05/14 06:27:32 build.go:534: Executing instruction 643 of 1083 - SetExecutionPhaseName
      agent:2019/05/14 06:27:32 build.go:783: 
      agent:2019/05/14 06:27:32 build.go:534: Executing instruction 644 of 1083 - RunQtUnitTest
      agent:2019/05/14 06:27:32 build.go:616: Running tests in directory C:/Users/qt/work/qt/qtbase/tests/auto/network/access/qnetworkreply/test
      agent:2019/05/14 06:27:32 runner.go:72: Generating test results with TESTARGS=-o C:\Users\qt\work\testresults\tests\auto\network\access\qnetworkreply\test826223173,xml -o -,txt
      agent:2019/05/14 06:27:32 build.go:305: [Mingw32-make check] 900 900
      agent:2019/05/14 06:27:32 build.go:197: Mingw32-make -f Makefile.Release check
      agent:2019/05/14 06:27:32 build.go:197: Mingw32-make[1]: Entering directory 'C:/Users/qt/work/qt/qtbase/tests/auto/network/access/qnetworkreply/test'
      agent:2019/05/14 06:27:32 build.go:197: cd /d .. && call C:\Users\qt\work\qt\qtbase\tests\auto\network\access\qnetworkreply\test\target_wrapper.bat tst_qnetworkreply.exe -o C:\Users\qt\work\testresults\tests\auto\network\access\qnetworkreply\test826223173,xml -o -,txt

      qtdeclarative:

      agent:2019/05/14 06:11:12 build.go:197: A crash occurred in C:\Users\qt\work\qt\qtdeclarative\tests\auto\qml\qqmllanguage\release\tst_qqmllanguage.exe.
      agent:2019/05/14 06:11:12 build.go:197: Function time: 63ms Total time: 9223ms
      agent:2019/05/14 06:11:12 build.go:197: 
      agent:2019/05/14 06:11:12 build.go:197: Exception address: 0x77c2289e
      agent:2019/05/14 06:11:12 build.go:197: Exception code : 0xc0000005
      agent:2019/05/14 06:11:12 build.go:197: Nearby symbol : RtlFreeHeap
      agent:2019/05/14 06:11:12 build.go:197: 
      agent:2019/05/14 06:11:12 build.go:197: Stack:
      agent:2019/05/14 06:11:12 build.go:197: # 1: ZN5QTest15toPrettyUnicodeEPKti() - 0x6efc2700
      agent:2019/05/14 06:11:12 build.go:197: # 2: UnhandledExceptionFilter() - 0x75e708c1
      agent:2019/05/14 06:11:12 build.go:197: # 3: EtwReplyNotification() - 0x77c475d4
      agent:2019/05/14 06:11:12 build.go:197: # 4: RtlInitializeExceptionChain() - 0x77c3358b
      agent:2019/05/14 06:11:12 build.go:197: 
      agent:2019/05/14 06:11:12 build.go:197: Mingw32-make[1]: *** [Makefile.Release:100: check] Error -1073741819
      agent:2019/05/14 06:11:12 build.go:197: Mingw32-make[1]: Leaving directory 'C:/Users/qt/work/qt/qtdeclarative/tests/auto/qml/qqmllanguage'
      agent:2019/05/14 06:11:12 build.go:197: Mingw32-make: *** [Makefile:286: release-check] Error 2
      agent:2019/05/14 06:11:12 build.go:230: Process finished with error: exit status 2
      agent:2019/05/14 06:11:12 build.go:200: Error reading from stdout/err: exit status 2
      agent:2019/05/14 06:11:12 build.go:783: 
      agent:2019/05/14 06:11:12 build.go:534: Executing instruction 147 of 483 - SetExecutionPhaseName
      agent:2019/05/14 06:11:12 build.go:783: 
      agent:2019/05/14 06:11:12 build.go:534: Executing instruction 148 of 483 - RunQtUnitTest
      agent:2019/05/14 06:11:12 build.go:616: Running tests in directory C:/Users/qt/work/qt/qtdeclarative/tests/auto/qml/qqmlopenmetaobject
      agent:2019/05/14 06:11:12 runner.go:72: Generating test results with TESTARGS=-o C:\Users\qt\work\testresults\tests\auto\qml\qqmlopenmetaobject798137759,xml -o -,txt
      agent:2019/05/14 06:11:12 build.go:305: [Mingw32-make check] 900 900
      agent:2019/05/14 06:11:13 build.go:197: Mingw32-make -f Makefile.Release check
      agent:2019/05/14 06:11:13 build.go:197: Mingw32-make[1]: Entering directory 'C:/Users/qt/work/qt/qtdeclarative/tests/auto/qml/qqmlopenmetaobject'
      agent:2019/05/14 06:11:13 build.go:197: call C:\Users\qt\work\qt\qtdeclarative\tests\auto\qml\qqmlopenmetaobject\target_wrapper.bat release\tst_qqmlopenmetaobject.exe -o C:\Users\qt\work\testresults\tests\auto\qml\qqmlopenmetaobject798137759,xml -o -,txt

      qtremoteobjects:

      agent:2019/05/14 05:51:33 build.go:197: A crash occurred in C:\Users\qt\work\qt\qtremoteobjects\tests\auto\external_IODevice\tst_client\tst_external_IODevice.exe.
      agent:2019/05/14 05:51:33 build.go:197: Function time: 2ms Total time: 1020ms
      agent:2019/05/14 05:51:33 build.go:197: 
      agent:2019/05/14 05:51:33 build.go:197: Exception address: 0x778c289e
      agent:2019/05/14 05:51:33 build.go:197: Exception code : 0xc0000005
      agent:2019/05/14 05:51:33 build.go:197: Nearby symbol : RtlFreeHeap
      agent:2019/05/14 05:51:33 build.go:197: 
      agent:2019/05/14 05:51:33 build.go:197: Stack:
      agent:2019/05/14 05:51:33 build.go:197: # 1: ZN5QTest15toPrettyUnicodeEPKti() - 0x6efc2700
      agent:2019/05/14 05:51:33 build.go:197: # 2: UnhandledExceptionFilter() - 0x75b108c1
      agent:2019/05/14 05:51:33 build.go:197: # 3: EtwReplyNotification() - 0x778e75d4
      agent:2019/05/14 05:51:33 build.go:197: # 4: RtlInitializeExceptionChain() - 0x778d358b
      agent:2019/05/14 05:51:33 build.go:197: 
      agent:2019/05/14 05:51:34 build.go:197: Mingw32-make[1]: *** [Makefile.Release:87: check] Error -1073741819
      agent:2019/05/14 05:51:34 build.go:197: Mingw32-make[1]: Leaving directory 'C:/Users/qt/work/qt/qtremoteobjects/tests/auto/external_IODevice/tst_client'
      agent:2019/05/14 05:51:34 build.go:197: Mingw32-make: *** [Makefile:298: release-check] Error 2
      agent:2019/05/14 05:51:34 build.go:230: Process finished with error: exit status 2
      agent:2019/05/14 05:51:34 build.go:200: Error reading from stdout/err: exit status 2
      agent:2019/05/14 05:51:54 runner.go:156: Re-running tests/auto/external_IODevice/tst_client with TESTARGS=testRun
      agent:2019/05/14 05:51:54 build.go:305: [Mingw32-make check] 900 900
      agent:2019/05/14 05:51:54 build.go:197: Mingw32-make -f Makefile.Release check
      agent:2019/05/14 05:51:54 build.go:197: Mingw32-make[1]: Entering directory 'C:/Users/qt/work/qt/qtremoteobjects/tests/auto/external_IODevice/tst_client'
      agent:2019/05/14 05:51:54 build.go:197: call C:\Users\qt\work\qt\qtremoteobjects\tests\auto\external_IODevice\tst_client\target_wrapper.bat .\tst_external_IODevice.exe testRun -maxwarnings 0
      agent:2019/05/14 05:51:55 build.go:197: A crash occurred in C:\Users\qt\work\qt\qtremoteobjects\tests\auto\external_IODevice\tst_client\tst_external_IODevice.exe.
      agent:2019/05/14 05:51:55 build.go:197: Function time: 2ms Total time: 496ms
      agent:2019/05/14 05:51:55 build.go:197: 
      agent:2019/05/14 05:51:55 build.go:197: Exception address: 0x778c289e
      agent:2019/05/14 05:51:55 build.go:197: Exception code : 0xc0000005
      agent:2019/05/14 05:51:55 build.go:197: Nearby symbol : RtlFreeHeap
      agent:2019/05/14 05:51:55 build.go:197: 
      agent:2019/05/14 05:51:55 build.go:197: Stack:
      agent:2019/05/14 05:51:55 build.go:197: # 1: ZN5QTest15toPrettyUnicodeEPKti() - 0x6efc2700
      agent:2019/05/14 05:51:55 build.go:197: # 2: UnhandledExceptionFilter() - 0x75b108c1
      agent:2019/05/14 05:51:55 build.go:197: # 3: EtwReplyNotification() - 0x778e75d4
      agent:2019/05/14 05:51:55 build.go:197: # 4: RtlInitializeExceptionChain() - 0x778d358b
      agent:2019/05/14 05:51:55 build.go:197: 
      agent:2019/05/14 05:51:55 build.go:197: Mingw32-make[1]: *** [Makefile.Release:87: check] Error -1073741819
      agent:2019/05/14 05:51:55 build.go:197: Mingw32-make[1]: Leaving directory 'C:/Users/qt/work/qt/qtremoteobjects/tests/auto/external_IODevice/tst_client'
      agent:2019/05/14 05:51:55 build.go:197: Mingw32-make: *** [Makefile:298: release-check] Error 2
      agent:2019/05/14 05:51:55 build.go:230: Process finished with error: exit status 2
      agent:2019/05/14 05:51:55 build.go:783: 
      agent:2019/05/14 05:51:55 build.go:534: Executing instruction 52 of 64 - SetExecutionPhaseName
      agent:2019/05/14 05:51:55 build.go:200: Error reading from stdout/err: exit status 2
      agent:2019/05/14 05:51:55 build.go:783: 
      agent:2019/05/14 05:51:55 build.go:534: Executing instruction 53 of 64 - RunQtUnitTest
      agent:2019/05/14 05:51:55 build.go:616: Running tests in directory C:/Users/qt/work/qt/qtremoteobjects/tests/auto/qml/integration
      agent:2019/05/14 05:51:55 runner.go:72: Generating test results with TESTARGS=-o C:\Users\qt\work\testresults\tests\auto\qml\integration703468739,xml -o -,txt
      agent:2019/05/14 05:51:55 build.go:305: [Mingw32-make check] 900 900
      agent:2019/05/14 05:51:56 build.go:197: Mingw32-make -f Makefile.Release check
      agent:2019/05/14 05:51:56 build.go:197: Mingw32-make[1]: Entering directory 'C:/Users/qt/work/qt/qtremoteobjects/tests/auto/qml/integration'
      agent:2019/05/14 05:51:56 build.go:197: call C:\Users\qt\work\qt\qtremoteobjects\tests\auto\qml\integration\target_wrapper.bat release\tst_integration.exe -o C:\Users\qt\work\testresults\tests\auto\qml\integration703468739,xml -o -,txt
      agent:2019/05/14 05:51:58 build.go:197: create: Could not initialize EGL display: error 0x3001
      agent:2019/05/14 05:51:58 build.go:197: create: When using ANGLE, check if d3dcompiler_4x.dll is available

      qtxmlpatterns: 

      agent:2019/05/14 05:58:01 build.go:197: ********* Finished testing of tst_QXmlQuery *********
      agent:2019/05/14 05:58:01 build.go:197: A crash occurred in C:\Users\qt\work\qt\qtxmlpatterns\tests\auto\qxmlquery\release\tst_qxmlquery.exe.
      agent:2019/05/14 05:58:01 build.go:197: Function time: 4ms Total time: 22143ms
      agent:2019/05/14 05:58:01 build.go:197: 
      agent:2019/05/14 05:58:01 build.go:197: Exception address: 0x778c289e
      agent:2019/05/14 05:58:01 build.go:197: Exception code : 0xc0000005
      agent:2019/05/14 05:58:01 build.go:197: Nearby symbol : RtlFreeHeap
      agent:2019/05/14 05:58:01 build.go:197: 
      agent:2019/05/14 05:58:01 build.go:197: Stack:
      agent:2019/05/14 05:58:01 build.go:197: # 1: ZN5QTest15toPrettyUnicodeEPKti() - 0x6efc2700
      agent:2019/05/14 05:58:01 build.go:197: # 2: UnhandledExceptionFilter() - 0x775b08c1
      agent:2019/05/14 05:58:01 build.go:197: # 3: EtwReplyNotification() - 0x778e75d4
      agent:2019/05/14 05:58:01 build.go:197: # 4: RtlInitializeExceptionChain() - 0x778d358b
      agent:2019/05/14 05:58:01 build.go:197: 
      agent:2019/05/14 05:58:01 build.go:197: Mingw32-make[1]: *** [Makefile.Release:95: check] Error -1073741819
      agent:2019/05/14 05:58:01 build.go:197: Mingw32-make[1]: Leaving directory 'C:/Users/qt/work/qt/qtxmlpatterns/tests/auto/qxmlquery'
      agent:2019/05/14 05:58:01 build.go:197: Mingw32-make: *** [Makefile:286: release-check] Error 2
      agent:2019/05/14 05:58:01 build.go:230: Process finished with error: exit status 2
      agent:2019/05/14 05:58:01 build.go:200: Error reading from stdout/err: exit status 2
      agent:2019/05/14 05:58:01 build.go:783: 
      agent:2019/05/14 05:58:01 build.go:534: Executing instruction 66 of 92 - SetExecutionPhaseName
      agent:2019/05/14 05:58:01 build.go:783: 
      agent:2019/05/14 05:58:01 build.go:534: Executing instruction 67 of 92 - RunQtUnitTest
      agent:2019/05/14 05:58:01 build.go:616: Running tests in directory C:/Users/qt/work/qt/qtxmlpatterns/tests/auto/qxmlresultitems
      agent:2019/05/14 05:58:01 runner.go:72: Generating test results with TESTARGS=-o C:\Users\qt\work\testresults\tests\auto\qxmlresultitems045671760,xml -o -,txt
      agent:2019/05/14 05:58:01 build.go:305: [Mingw32-make check] 900 900
      agent:2019/05/14 05:58:02 build.go:197: Mingw32-make -f Makefile.Release check
      agent:2019/05/14 05:58:02 build.go:197: Mingw32-make[1]: Entering directory 'C:/Users/qt/work/qt/qtxmlpatterns/tests/auto/qxmlresultitems'
      agent:2019/05/14 05:58:02 build.go:197: call C:\Users\qt\work\qt\qtxmlpatterns\tests\auto\qxmlresultitems\target_wrapper.bat release\tst_qxmlresultitems.exe -o C:\Users\qt\work\testresults\tests\auto\qxmlresultitems045671760,xml -o -,txt

        Attachments

        1. openssl_1.1.1b_prebuild_x86 .7z
          3.61 MB
          Heikki Halmet
        2. qtremoteobjects test windows 7 mingw73-x86.txt.gz
          387 kB
          Heikki Halmet
        3. qtxmlpatterns test windows 7 mingw73-x86.txt.gz
          393 kB
          Heikki Halmet

          Issue Links

          No reviews matched the request. Check your Options in the drop-down menu of this sections header.

            Activity

              People

              • Assignee:
                hehalmet Heikki Halmet
                Reporter:
                hehalmet Heikki Halmet
              • Votes:
                0 Vote for this issue
                Watchers:
                9 Start watching this issue

                Dates

                • Created:
                  Updated:
                  Resolved:

                  Gerrit Reviews

                  There are no open Gerrit changes