Uploaded image for project: 'Qt'
  1. Qt
  2. QTBUG-77304

undefined reference to `ui::InputMethodAuraLinux::InputMethodAuraLinux(ui::internal::InputMethodDelegate*)'

    XMLWordPrintable

    Details

    • Type: Bug
    • Status: Closed
    • Priority: P1: Critical
    • Resolution: Done
    • Affects Version/s: 5.13.1
    • Fix Version/s: 5.13.1, 5.14.0 Beta 1
    • Component/s: WebEngine
    • Labels:
      None
    • Platform/s:
      Linux/Other display system
    • Commits:
      3531476f515a7ddfd73a2dbd31d71ae8d9da3d67 (qt/qtwebengine/5.13)

      Description

      https://codereview.qt-project.org/c/qt/qt5/+/263051 Merge remote-tracking branch 'origin/5.12' into 5.13

      https://testresults.qt.io/coin/integration/qt/qt5/tasks/1564766577

      https://testresults.qt.io/coin/api/results/qt/qtwebengine/f92a0377ab99228e290a846cc4390f49e8a6616b/LinuxUbuntu_18_04x86_64LinuxQEMUarm64GCCqtci-linux-Ubuntu-18.04-x86_64-3105e1/261b12cb719bf628afb8ba1c493750e72c99931d/build_1564759145/log.txt.gz

      agent:2019/08/02 16:07:50 build.go:207: perl /home/qt/work/install/mkspecs/features/data/unix/findclasslist.pl < QtWebEngineCore.version.in > QtWebEngineCore.version
      agent:2019/08/02 16:07:52 build.go:207: rm -f libQt5WebEngineCore.so.5.13.1 libQt5WebEngineCore.so libQt5WebEngineCore.so.5 libQt5WebEngineCore.so.5.13
      agent:2019/08/02 16:07:52 build.go:207: /opt/yocto-arm64/sysroots/x86_64-pokysdk-linux/usr/bin/aarch64-poky-linux/aarch64-poky-linux-g++ --sysroot=/opt/yocto-arm64/sysroots/aarch64-poky-linux @/home/qt/work/qt/qtwebengine/src/core/debug/QtWebEngineCore_o.rsp -Wl,--start-group @/home/qt/work/qt/qtwebengine/src/core/debug/QtWebEngineCore_a.rsp -Wl,--end-group -Wl,-z,noexecstack -Wl,--fatal-warnings -fPIC -Wl,-z,now -Wl,-z,relro -Wl,-z,defs --sysroot=../../../../../../../../opt/yocto-arm64/sysroots/aarch64-poky-linux --sysroot=/opt/yocto-arm64/sysroots/aarch64-poky-linux -Wl,--enable-new-dtags -Wl,-rpath=/home/qt/work/install/lib -Wl,-rpath=/home/qt/work/install/lib -Wl,-whole-archive -lqtwebenginecoreapi -Wl,-no-whole-archive -Wl,--no-undefined -Wl,--version-script,QtWebEngineCore.version -Wl,--enable-new-dtags -Wl,-z,origin -Wl,-rpath,\$ORIGIN -Wl,-rpath,\$ORIGIN -shared -Wl,-soname,libQt5WebEngineCore.so.5 -o libQt5WebEngineCore.so.5.13.1   /home/qt/work/install/lib/libQt5Quick.so /home/qt/work/install/lib/libQt5Gui.so /home/qt/work/install/lib/libQt5WebChannel.so /home/qt/work/install/lib/libQt5Qml.so /home/qt/work/install/lib/libQt5Network.so /home/qt/work/install/lib/libQt5Positioning.so /home/qt/work/install/lib/libQt5Core.so -lpthread -lpthread -ldl -lrt -lsmime3 -lnss3 -lsoftokn3 -lnssutil3 -lplds4 -lplc4 -lnspr4 -levent -lresolv -ljpeg -lfontconfig -lpng16 -lz -lwebpmux -lwebpdemux -lwebp -lfreetype -lexpat -lasound -lm -lpci -ldbus-1 -L/home/qt/work/qt/qtwebengine/src/core/api/debug /opt/yocto-arm64/sysroots/aarch64-poky-linux/usr/lib/libGLESv2.so   
      agent:2019/08/02 16:11:51 build.go:207: /home/qt/work/qt/qtwebengine/src/core/debug/obj/ui/base/ime/ime/ime_jumbo_1.o: In function `std::_MakeUniq<ui::InputMethodAuraLinux>::__single_object std::make_unique<ui::InputMethodAuraLinux, ui::internal::InputMethodDelegate*&>(ui::internal::InputMethodDelegate*&)':
      agent:2019/08/02 16:11:51 build.go:207: /opt/yocto-arm64/sysroots/aarch64-poky-linux/usr/include/c++/7.3.0/bits/unique_ptr.h:825: undefined reference to `ui::InputMethodAuraLinux::InputMethodAuraLinux(ui::internal::InputMethodDelegate*)'
      agent:2019/08/02 16:11:51 build.go:207: collect2: error: ld returned 1 exit status
      agent:2019/08/02 16:11:51 build.go:207: Makefile.core_module:85: recipe for target '../../lib/libQt5WebEngineCore.so.5.13.1' failed
      agent:2019/08/02 16:11:51 build.go:207: make[3]: *** [../../lib/libQt5WebEngineCore.so.5.13.1] Error 1
      agent:2019/08/02 16:11:51 build.go:207: make[3]: Leaving directory '/home/qt/work/qt/qtwebengine/src/core'
      agent:2019/08/02 16:11:51 build.go:207: Makefile:124: recipe for target 'sub-core_module-pro-make_first' failed
      agent:2019/08/02 16:11:51 build.go:207: make[2]: *** [sub-core_module-pro-make_first] Error 2
      agent:2019/08/02 16:11:51 build.go:207: make[2]: Leaving directory '/home/qt/work/qt/qtwebengine/src/core'
      agent:2019/08/02 16:11:51 build.go:207: Makefile:76: recipe for target 'sub-core-make_first' failed
      agent:2019/08/02 16:11:51 build.go:207: make[1]: *** [sub-core-make_first] Error 2
      agent:2019/08/02 16:11:51 build.go:207: make[1]: Leaving directory '/home/qt/work/qt/qtwebengine/src'
      agent:2019/08/02 16:11:51 build.go:207: Makefile:48: recipe for target 'sub-src-make_first' failed
      agent:2019/08/02 16:11:51 build.go:207: make: *** [sub-src-make_first] Error 2
      agent:2019/08/02 16:11:51 build.go:240: Process finished with error: exit status 2
      agent:2019/08/02 16:11:51 build.go:531: Executing scheduled instruction 1 of 1 - Upload all core dumps if there are some
      agent:2019/08/02 16:11:51 build.go:210: Error reading from stdout/err: exit status 2
      

        Attachments

        No reviews matched the request. Check your Options in the drop-down menu of this sections header.

          Activity

            People

            • Assignee:
              qt_webengine_team Qt WebEngine Team
              Reporter:
              liaqi Liang Qi
            • Votes:
              0 Vote for this issue
              Watchers:
              4 Start watching this issue

              Dates

              • Created:
                Updated:
                Resolved:

                Gerrit Reviews

                There are no open Gerrit changes