Uploaded image for project: 'Qt'
  1. Qt
  2. QTBUG-77369

androiddeployqt: creating release apk fails when checking sign option

    XMLWordPrintable

    Details

    • Type: Bug
    • Status: Closed
    • Priority: P2: Important
    • Resolution: Cannot Reproduce
    • Affects Version/s: 5.13.0
    • Fix Version/s: None
    • Component/s: Build tools: Other
    • Labels:
      None
    • Environment:
      Ubuntu 16.04
      Qt 5.13 android armeabi_v7a Clang
      Android SDK 28
      Android NDK 20
      OpenJDK 8
      Qt Creator 4.9.1
    • Platform/s:
      Android, Linux/X11

      Description

      My project builds normally in release and debug mode, the only problem is creating signed apk. Part of the log is:

      :lintVitalRelease (Thread[Task worker for ':' Thread 3,5,main]) started.
      :lintVitalRelease
      Task ':lintVitalRelease' is not up-to-date because:
        Task has not declared any outputs.
      :lintVitalRelease FAILED
      :lintVitalRelease (Thread[Task worker for ':' Thread 3,5,main]) completed. Took 0.835 secs.
      
      FAILURE: Build failed with an exception.
      
      * What went wrong:
      Execution failed for task ':lintVitalRelease'.
      > Lint infrastructure error
        Caused by: java.lang.reflect.InvocationTargetException
        	at sun.reflect.NativeMethodAccessorImpl.invoke0(Native Method)
        	at sun.reflect.NativeMethodAccessorImpl.invoke(NativeMethodAccessorImpl.java:62)
        	at sun.reflect.DelegatingMethodAccessorImpl.invoke(DelegatingMethodAccessorImpl.java:43)
        	at java.lang.reflect.Method.invoke(Method.java:498)
        	at com.android.tools.lint.gradle.api.ReflectiveLintRunner.runLint(ReflectiveLintRunner.kt:38)
        	at com.android.build.gradle.tasks.LintBaseTask.runLint(LintBaseTask.java:88)
        	at com.android.build.gradle.tasks.LintPerVariantTask.lint(LintPerVariantTask.java:41)
        	at sun.reflect.NativeMethodAccessorImpl.invoke0(Native Method)
        	at sun.reflect.NativeMethodAccessorImpl.invoke(NativeMethodAccessorImpl.java:62)
        	at sun.reflect.DelegatingMethodAccessorImpl.invoke(DelegatingMethodAccessorImpl.java:43)
        	at java.lang.reflect.Method.invoke(Method.java:498)
        	at org.gradle.internal.reflect.JavaMethod.invoke(JavaMethod.java:73)
        	at org.gradle.api.internal.project.taskfactory.StandardTaskAction.doExecute(StandardTaskAction.java:46)
        	at org.gradle.api.internal.project.taskfactory.StandardTaskAction.execute(StandardTaskAction.java:39)
        	at org.gradle.api.internal.project.taskfactory.StandardTaskAction.execute(StandardTaskAction.java:26)
        	at org.gradle.api.internal.AbstractTask$TaskActionWrapper.execute(AbstractTask.java:788)
        	at org.gradle.api.internal.AbstractTask$TaskActionWrapper.execute(AbstractTask.java:755)
        	at org.gradle.api.internal.tasks.execution.ExecuteActionsTaskExecuter$1.run(ExecuteActionsTaskExecuter.java:124)
        	at org.gradle.internal.progress.DefaultBuildOperationExecutor$RunnableBuildOperationWorker.execute(DefaultBuildOperationExecutor.java:336)
        	at org.gradle.internal.progress.DefaultBuildOperationExecutor$RunnableBuildOperationWorker.execute(DefaultBuildOperationExecutor.java:328)
        	at org.gradle.internal.progress.DefaultBuildOperationExecutor.execute(DefaultBuildOperationExecutor.java:199)
        	at org.gradle.internal.progress.DefaultBuildOperationExecutor.run(DefaultBuildOperationExecutor.java:110)
        	at org.gradle.api.internal.tasks.execution.ExecuteActionsTaskExecuter.executeAction(ExecuteActionsTaskExecuter.java:113)
        	at org.gradle.api.internal.tasks.execution.ExecuteActionsTaskExecuter.executeActions(ExecuteActionsTaskExecuter.java:95)
        	at org.gradle.api.internal.tasks.execution.ExecuteActionsTaskExecuter.execute(ExecuteActionsTaskExecuter.java:73)
        	at org.gradle.api.internal.tasks.execution.OutputDirectoryCreatingTaskExecuter.execute(OutputDirectoryCreatingTaskExecuter.java:51)
        	at org.gradle.api.internal.tasks.execution.SkipUpToDateTaskExecuter.execute(SkipUpToDateTaskExecuter.java:59)
        	at org.gradle.api.internal.tasks.execution.ResolveTaskOutputCachingStateExecuter.execute(ResolveTaskOutputCachingStateExecuter.java:54)
        	at org.gradle.api.internal.tasks.execution.ValidatingTaskExecuter.execute(ValidatingTaskExecuter.java:59)
        	at org.gradle.api.internal.tasks.execution.SkipEmptySourceFilesTaskExecuter.execute(SkipEmptySourceFilesTaskExecuter.java:101)
        	at org.gradle.api.internal.tasks.execution.FinalizeInputFilePropertiesTaskExecuter.execute(FinalizeInputFilePropertiesTaskExecuter.java:44)
        	at org.gradle.api.internal.tasks.execution.CleanupStaleOutputsExecuter.execute(CleanupStaleOutputsExecuter.java:91)
        	at org.gradle.api.internal.tasks.execution.ResolveTaskArtifactStateTaskExecuter.execute(ResolveTaskArtifactStateTaskExecuter.java:62)
        	at org.gradle.api.internal.tasks.execution.SkipTaskWithNoActionsExecuter.execute(SkipTaskWithNoActionsExecuter.java:59)
        	at org.gradle.api.internal.tasks.execution.SkipOnlyIfTaskExecuter.execute(SkipOnlyIfTaskExecuter.java:54)
        	at org.gradle.api.internal.tasks.execution.ExecuteAtMostOnceTaskExecuter.execute(ExecuteAtMostOnceTaskExecuter.java:43)
        	at org.gradle.api.internal.tasks.execution.CatchExceptionTaskExecuter.execute(CatchExceptionTaskExecuter.java:34)
        	at org.gradle.execution.taskgraph.DefaultTaskGraphExecuter$EventFiringTaskWorker$1.run(DefaultTaskGraphExecuter.java:256)
        	at org.gradle.internal.progress.DefaultBuildOperationExecutor$RunnableBuildOperationWorker.execute(DefaultBuildOperationExecutor.java:336)
        	at org.gradle.internal.progress.DefaultBuildOperationExecutor$RunnableBuildOperationWorker.execute(DefaultBuildOperationExecutor.java:328)
        	at org.gradle.internal.progress.DefaultBuildOperationExecutor.execute(DefaultBuildOperationExecutor.java:199)
        	at org.gradle.internal.progress.DefaultBuildOperationExecutor.run(DefaultBuildOperationExecutor.java:110)
        	at org.gradle.execution.taskgraph.DefaultTaskGraphExecuter$EventFiringTaskWorker.execute(DefaultTaskGraphExecuter.java:249)
        	at org.gradle.execution.taskgraph.DefaultTaskGraphExecuter$EventFiringTaskWorker.execute(DefaultTaskGraphExecuter.java:238)
        	at org.gradle.execution.taskgraph.DefaultTaskPlanExecutor$TaskExecutorWorker.processTask(DefaultTaskPlanExecutor.java:123)
        	at org.gradle.execution.taskgraph.DefaultTaskPlanExecutor$TaskExecutorWorker.access$200(DefaultTaskPlanExecutor.java:79)
        	at org.gradle.execution.taskgraph.DefaultTaskPlanExecutor$TaskExecutorWorker$1.execute(DefaultTaskPlanExecutor.java:104)
        	at org.gradle.execution.taskgraph.DefaultTaskPlanExecutor$TaskExecutorWorker$1.execute(DefaultTaskPlanExecutor.java:98)
        	at org.gradle.execution.taskgraph.DefaultTaskExecutionPlan.execute(DefaultTaskExecutionPlan.java:663)
        	at org.gradle.execution.taskgraph.DefaultTaskExecutionPlan.executeWithTask(DefaultTaskExecutionPlan.java:597)
        	at org.gradle.execution.taskgraph.DefaultTaskPlanExecutor$TaskExecutorWorker.run(DefaultTaskPlanExecutor.java:98)
        	at org.gradle.internal.concurrent.ExecutorPolicy$CatchAndRecordFailures.onExecute(ExecutorPolicy.java:63)
        	at org.gradle.internal.concurrent.ManagedExecutorImpl$1.run(ManagedExecutorImpl.java:46)
        	at java.util.concurrent.ThreadPoolExecutor.runWorker(ThreadPoolExecutor.java:1149)
        	at java.util.concurrent.ThreadPoolExecutor$Worker.run(ThreadPoolExecutor.java:624)
        	at org.gradle.internal.concurrent.ThreadFactoryImpl$ManagedThreadRunnable.run(ThreadFactoryImpl.java:55)
        	at java.lang.Thread.run(Thread.java:748)
        Caused by: java.lang.NoClassDefFoundError: org/jetbrains/uast/UElement
        	at com.android.tools.lint.checks.BuiltinIssueRegistry.<clinit>(BuiltinIssueRegistry.java:44)
        	at com.android.tools.lint.gradle.LintGradleExecution.createIssueRegistry(LintGradleExecution.java:358)
        	at com.android.tools.lint.gradle.LintGradleExecution.runLint(LintGradleExecution.java:216)
        	at com.android.tools.lint.gradle.LintGradleExecution.lintSingleVariant(LintGradleExecution.java:368)
        	at com.android.tools.lint.gradle.LintGradleExecution.analyze(LintGradleExecution.java:91)
        	... 57 more
        Caused by: java.lang.ClassNotFoundException: org.jetbrains.uast.UElement
        	at java.net.URLClassLoader.findClass(URLClassLoader.java:382)
        	at java.lang.ClassLoader.loadClass(ClassLoader.java:424)
        	at java.lang.ClassLoader.loadClass(ClassLoader.java:357)
        	at com.android.tools.lint.gradle.api.DelegatingClassLoader.findClass(DelegatingClassLoader.kt:32)
        	at java.lang.ClassLoader.loadClass(ClassLoader.java:424)
        	at java.lang.ClassLoader.loadClass(ClassLoader.java:357)
        	... 62 more
        
      
      
      * Try:
      Run with --stacktrace option to get the stack trace. Run with --debug option to get more log output. Run with --scan to get full insights.
      
      * Get more help at https://help.gradle.org
      
      BUILD FAILED in 7s
      

       

      It also creates unsigned apks normally. The only way I can create signed apks is adding a lint option to build.gradle file as:

      lintOptions {
      checkReleaseBuilds false
      }
      

        Attachments

          Issue Links

          No reviews matched the request. Check your Options in the drop-down menu of this sections header.

            Activity

              People

              Assignee:
              esabraha Eskil Abrahamsen Blomfeldt
              Reporter:
              nejatafshar Nejat Afshar
              Votes:
              0 Vote for this issue
              Watchers:
              2 Start watching this issue

                Dates

                Created:
                Updated:
                Resolved:

                  Gerrit Reviews

                  There are no open Gerrit changes