Uploaded image for project: 'Qt'
  1. Qt
  2. QTBUG-78450

qtdeclarative build failure on INTEGRITY

    XMLWordPrintable

    Details

    • Platform/s:
      Integrity
    • Commits:
      1283ee324578e4cf5cc210d8d3c89647d6c56ec3

      Description

      https://codereview.qt-project.org/c/qt/qt5/+/274175 Update submodules on '5.14' in qt/qt5

      http://coin/coin/integration/qt/qt5/tasks/1568717943

      http://coin/coin/api/results/qt/qtdeclarative/3c2d0d52eed3e9c4606464ed0d204ee4ab7b0a3f/LinuxRHEL_7_6x86_64INTEGRITYINTEGRITY_11_04armv7GCCqtci-linux-RHEL-7.6-x86_64-b4df3dDisableTests/729883cf43d56969df86174b68564a0de4788498/build_1568718312/log.txt.gz

      agent:2019/09/17 12:11:43 build.go:220: cxintarm -bsp platform-cortex-a9 -os_dir /opt/ghs/int1144 -non_shared -c -bigswitch --signed_fields --no_commons --diag_suppress=1,82,228,236,381,611,961,997,1795,1974 --no_implicit_include --link_once_templates -non_shared --new_outside_of_constructor -DINTEGRITY -Ospeed -Olink -Omax --c++11 --thread_local_storage --exceptions -DQT_STATICPLUGIN -DQT_NO_LINKED_LIST -DQT_NO_LINKED_LIST -DQT_NO_JAVA_STYLE_ITERATORS -DQT_QML_DEBUG_NO_WARNING -DQT_NO_NARROWING_CONVERSIONS_IN_CONNECT -DQT_USE_QSTRINGBUILDER -DQT_NO_DEBUG -DQT_QML_LIB -DQT_NETWORK_LIB -DQT_WIDGETS_LIB -DQT_GUI_LIB -DQT_CORE_LIB -I. -I../../include/QtQml/5.14.0 -I../../include/QtQml/5.14.0/QtQml -I../../include -I../../include/QtQml -I/home/qt/work/install/include/QtCore/5.14.0 -I/home/qt/work/install/include/QtCore/5.14.0/QtCore -I/home/qt/work/install/include -I/home/qt/work/install/include/QtNetwork -I/home/qt/work/install/include/QtWidgets -I/home/qt/work/install/include/QtGui -I/home/qt/work/install/include/QtCore -I.moc -I/opt/ghs/int1144/INTEGRITY-include/Vivante/sdk/inc -I/home/qt/work/install/mkspecs/integrity-armv7-imx6 -o .obj/moc_conf.o .moc/moc_conf.cpp
      agent:2019/09/17 12:11:44 build.go:220: [elxr] (error #412) unresolved symbols: 6
      agent:2019/09/17 12:11:44 build.go:220:  _Cnd_destroy 	from libQt5Core.a(qreadwritelock.o)
      agent:2019/09/17 12:11:44 build.go:220:  _Cnd_init 	from libQt5Core.a(qreadwritelock.o)
      agent:2019/09/17 12:11:44 build.go:220:  _Cnd_timedwait 	from libQt5Core.a(qreadwritelock.o)
      agent:2019/09/17 12:11:44 build.go:220:  _Cnd_wait 	from libQt5Core.a(qreadwritelock.o)
      agent:2019/09/17 12:11:44 build.go:220:  _Cnd_broadcast 	from libQt5Core.a(qreadwritelock.o)
      agent:2019/09/17 12:11:44 build.go:220:  _Cnd_signal 	from libQt5Core.a(qreadwritelock.o)
      agent:2019/09/17 12:11:44 build.go:220: 
      agent:2019/09/17 12:11:44 build.go:220: [elxr] (error) errors during processing
      agent:2019/09/17 12:11:44 build.go:220: make[2]: *** [../../bin/qmltestrunner] Error 1
      agent:2019/09/17 12:11:44 build.go:220: make[2]: Leaving directory `/home/qt/work/qt/qtdeclarative/tools/qmltestrunner'
      agent:2019/09/17 12:11:44 build.go:220: make[1]: *** [sub-qmltestrunner-make_first] Error 2
      agent:2019/09/17 12:11:44 build.go:220: make[1]: *** Waiting for unfinished jobs....
      agent:2019/09/17 12:11:46 build.go:220: g++ -Wl,-O1 -Wl,--gc-sections -o ../../bin/qmllint .obj/main.o .obj/componentversion.o .obj/fakemetaobject.o .obj/findunqualified.o .obj/qmljstypedescriptionreader.o .obj/qcoloroutput.o .obj/scopetree.o   /home/qt/work/qt/qtdeclarative/lib/libQt5QmlDevTools.a /home/qt/work/install/lib/libQt5Bootstrap.a -lpthread   
      agent:2019/09/17 12:11:46 build.go:220: make[2]: Leaving directory `/home/qt/work/qt/qtdeclarative/tools/qmllint'
      agent:2019/09/17 12:11:51 build.go:220: cxintarm -bsp platform-cortex-a9 -os_dir /opt/ghs/int1144 -non_shared --signed_fields --no_commons --no_implicit_include --link_once_templates -non_shared --new_outside_of_constructor -Ospeed -Olink -Omax --c++11 --thread_local_storage --exceptions -o ../../bin/qml .obj/main.o .obj/qml_plugin_import.o .obj/qml_qml_plugin_import.o .obj/qrc_qml.o .obj/moc_conf.o   -L/opt/ghs/int1144/libs/Vivante /home/qt/work/qt/qtdeclarative/plugins/qmltooling/libqmldbg_debugger.a /home/qt/work/qt/qtdeclarative/plugins/qmltooling/libqmldbg_inspector.a /home/qt/work/qt/qtdeclarative/plugins/qmltooling/libqmldbg_local.a /home/qt/work/qt/qtdeclarative/plugins/qmltooling/libqmldbg_messages.a /home/qt/work/qt/qtdeclarative/plugins/qmltooling/libqmldbg_native.a /home/qt/work/qt/qtdeclarative/plugins/qmltooling/libqmldbg_nativedebugger.a /home/qt/work/qt/qtdeclarative/plugins/qmltooling/libqmldbg_preview.a /home/qt/work/qt/qtdeclarative/plugins/qmltooling/libqmldbg_profiler.a /home/qt/work/qt/qtdeclarative/plugins/qmltooling/libqmldbg_quickprofiler.a /home/qt/work/qt/qtdeclarative/plugins/qmltooling/libqmldbg_server.a /home/qt/work/qt/qtdeclarative/lib/libQt5PacketProtocol.a /home/qt/work/qt/qtdeclarative/plugins/qmltooling/libqmldbg_tcp.a /home/qt/work/install/plugins/imageformats/libqgif.a /home/qt/work/install/plugins/imageformats/libqico.a /home/qt/work/install/plugins/imageformats/libqjpeg.a /home/qt/work/install/lib/libQt5Widgets.a /home/qt/work/qt/qtdeclarative/qml/QtQuick/Window.2/libwindowplugin.a /home/qt/work/qt/qtdeclarative/qml/QtQuick.2/libqtquick2plugin.a /home/qt/work/qt/qtdeclarative/lib/libQt5Quick.a /home/qt/work/qt/qtdeclarative/lib/libQt5QmlModels.a /home/qt/work/qt/qtdeclarative/lib/libQt5QmlWorkerScript.a /home/qt/work/qt/qtdeclarative/lib/libQt5Qml.a /home/qt/work/install/lib/libQt5Gui.a /home/qt/work/install/lib/libqtlibpng.a /home/qt/work/install/lib/libqtharfbuzz.a -lhiddev /home/qt/work/install/lib/libQt5Network.a /home/qt/work/install/lib/libQt5Core.a -lposix -lsocket -lnet -lshm_client /home/qt/work/install/lib/libqtpcre2.a -lGLESv2 -lEGL -lGAL -lVSC -lGLSLC -lfbdev -livfs   
      agent:2019/09/17 12:11:54 build.go:220: [elxr] (error #412) unresolved symbols: 6
      agent:2019/09/17 12:11:54 build.go:220:  _Cnd_destroy 	from libQt5Core.a(qreadwritelock.o)
      agent:2019/09/17 12:11:54 build.go:220:  _Cnd_init 	from libQt5Core.a(qreadwritelock.o)
      agent:2019/09/17 12:11:54 build.go:220:  _Cnd_timedwait 	from libQt5Core.a(qreadwritelock.o)
      agent:2019/09/17 12:11:54 build.go:220:  _Cnd_wait 	from libQt5Core.a(qreadwritelock.o)
      agent:2019/09/17 12:11:54 build.go:220:  _Cnd_broadcast 	from libQt5Core.a(qreadwritelock.o)
      agent:2019/09/17 12:11:54 build.go:220:  _Cnd_signal 	from libQt5Core.a(qreadwritelock.o)
      agent:2019/09/17 12:11:54 build.go:220: 
      agent:2019/09/17 12:11:54 build.go:220: [elxr] (error) errors during processing
      agent:2019/09/17 12:11:54 build.go:220: make[2]: *** [../../bin/qml] Error 1
      agent:2019/09/17 12:11:54 build.go:220: make[2]: Leaving directory `/home/qt/work/qt/qtdeclarative/tools/qml'
      agent:2019/09/17 12:11:54 build.go:220: make[1]: *** [sub-qml-make_first] Error 2
      agent:2019/09/17 12:11:54 build.go:220: make[1]: Leaving directory `/home/qt/work/qt/qtdeclarative/tools'
      agent:2019/09/17 12:11:54 build.go:220: make: *** [sub-tools-make_first] Error 2
      agent:2019/09/17 12:11:54 build.go:253: Process finished with error: exit status 2
      agent:2019/09/17 12:11:54 build.go:471: Executing scheduled instruction 1 of 1 - Upload all core dumps if there are some
      agent:2019/09/17 12:11:54 build.go:384: Skipping uploadCoreFiles() because CORE_FILES_PATH is not set
      agent:2019/09/17 12:11:54 build.go:473: 
      agent:2019/09/17 12:11:54 build.go:223: Error reading from stdout/err: exit status 2
      agent:2019/09/17 12:11:54 agent.go:270: Build failed
      agent:2019/09/17 12:11:54 agent.go:200: ERROR building: exit status 2
      2019-09-17 12:11:55,225 INFO:workitem.py:640(25474): Agent FINISHED FAIL: <could not determine failure location - check log!>: qt/qtdeclarative/3c2d0d52eed3e9c4606464ed0d204ee4ab7b0a3f/LinuxRHEL_7_6x86_64INTEGRITYINTEGRITY_11_04armv7GCCqtci-linux-RHEL-7.6-x86_64-b4df3dDisableTests/729883cf43d56969df86174b68564a0de4788498/Build
      

        Attachments

        No reviews matched the request. Check your Options in the drop-down menu of this sections header.

          Activity

            People

            Assignee:
            janihe Jani Heikkinen
            Reporter:
            liaqi Liang Qi
            Votes:
            0 Vote for this issue
            Watchers:
            6 Start watching this issue

              Dates

              Created:
              Updated:
              Resolved:

                Gerrit Reviews

                There are no open Gerrit changes