Uploaded image for project: 'Qt'
  1. Qt
  2. QTBUG-81599

iOS & WatchOS build failure in qtdeclarative (during qt5.git integration #5.14.1)

    XMLWordPrintable

    Details

    • Type: Bug
    • Status: Closed
    • Priority: P0: Blocker
    • Resolution: Done
    • Affects Version/s: 5.14.1
    • Fix Version/s: 5.14.1, 5.15.0 Alpha
    • Component/s: Build System
    • Labels:
      None
    • Commits:
      0ab53fbdda2fd7f24f45dcd52fbd195e282554da (qt/qtbase/5.14.1)

      Description

      Build has failed 3 times in a row now, see https://codereview.qt-project.org/c/qt/qt5/+/287535

      /Applications/Xcode11.app/Contents/Developer/Toolchains/XcodeDefault.xctoolchain/usr/bin/ranlib: archive member: ../../lib/libQt5Quick.a(qquickprofiler.o) size too large (archive member extends past the end of the file)
      /Applications/Xcode11.app/Contents/Developer/Toolchains/XcodeDefault.xctoolchain/usr/bin/ar: internal ranlib command failed
      make[3]: *** [../../lib/libQt5Quick.a] Error 1
      make[2]: *** [debug-all] Error 2
      make[2]: *** Waiting for unfinished jobs....
      /Applications/Xcode11.app/Contents/Developer/Toolchains/XcodeDefault.xctoolchain/usr/bin/ranlib -s ../../lib/libQt5Quick.a
      make[1]: *** [sub-quick-make_first-ordered] Error 2

      1512: make[2]: *** [debug-all] Error 2
      make[2]: *** Waiting for unfinished jobs....
      /Applications/Xcode11.app/Contents/Developer/Toolchains/XcodeDefault.xctoolchain/usr/bin/ranlib -s ../../lib/libQt5Quick.a
      make[1]: *** [sub-quick-make_first-ordered] Error 2
      make: *** [sub-src-make_first] Error 2
      Process finished with error: exit status 2
      Executing scheduled instruction 1 of 1 - Upload all core dumps if there are some
      Skip uploading core files because CORE_FILES_PATH is not set in the environment
      agent:2020/01/23 04:24:09 build.go:473:
      Build failed
      ERROR building: exit status 2

      Build log: https://testresults.qt.io/logs/qt/qtdeclarative/d887ef986f357614624d65277f94d740c410be21/MacOSMacOS_10_14x86_64WatchOSWatchOS_ANYmultiClangqtci-macos-10.14-x86_64-55f36aDisableTests/4ddbba6f35d6fe9b382b5f27d59b61672939eb46/build_1579752677/log.txt.gz

      Details: https://testresults.qt.io/coin/integration/qt/qt5/tasks/1579752561
      Tested changes (refs/builds/qtci/5.14.1/1579752561):
      https://codereview.qt-project.org/c/qt/qt5/+/287535 Update submodules on '5.14.1' in qt

        Attachments

        No reviews matched the request. Check your Options in the drop-down menu of this sections header.

          Activity

            People

            Assignee:
            jbornema Joerg Bornemann
            Reporter:
            janihe Jani Heikkinen
            Votes:
            0 Vote for this issue
            Watchers:
            4 Start watching this issue

              Dates

              Created:
              Updated:
              Resolved:

                Gerrit Reviews

                There are no open Gerrit changes