Uploaded image for project: 'Qt'
  1. Qt
  2. QTBUG-85216

Build errors when using WinSDK 10.0.16299.0

    XMLWordPrintable

    Details

    • Type: Bug
    • Status: Closed
    • Priority: Not Evaluated
    • Resolution: Out of scope
    • Affects Version/s: 5.12.9
    • Fix Version/s: None
    • Component/s: Core: Plugins
    • Labels:
      None
    • Platform/s:
      Windows

      Description

      c:\program files (x86)\windows kits\10\include\10.0.16299.0\winrt\Windows.ApplicationModel.Contacts.h(7090): error C2146: syntax error: missing '}' before identifier 'DEPRECATEDENUMERATOR' (compiling source file Z:\src\qtbase\src\plugins\platforms\windows\qwin10helpers.cpp)
      c:\program files (x86)\windows kits\10\include\10.0.16299.0\winrt\Windows.ApplicationModel.Contacts.h(7090): error C2143: syntax error: missing ';' before '<L_TYPE_raw>' (compiling source file Z:\src\qtbase\src\plugins\platforms\windows\qwin10helpers.cpp)
      c:\program files (x86)\windows kits\10\include\10.0.16299.0\winrt\Windows.ApplicationModel.Contacts.h(7148): error C2143: syntax error: missing ';' before '}' (compiling source file Z:\src\qtbase\src\plugins\platforms\windows\qwin10helpers.cpp)
      c:\program files (x86)\windows kits\10\include\10.0.16299.0\winrt\Windows.ApplicationModel.Contacts.h(7152): error C2059: syntax error: '}' (compiling source file Z:\src\qtbase\src\plugins\platforms\windows\qwin10helpers.cpp)
      c:\program files (x86)\windows kits\10\include\10.0.16299.0\winrt\Windows.ApplicationModel.Contacts.h(7152): error C2143: syntax error: missing ';' before '}' (compiling source file Z:\src\qtbase\src\plugins\platforms\windows\qwin10helpers.cpp)
      c:\program files (x86)\windows kits\10\include\10.0.16299.0\winrt\Windows.ApplicationModel.Contacts.h(7166): error C2143: syntax error: missing ';' before '{' (compiling source file Z:\src\qtbase\src\plugins\platforms\windows\qwin10helpers.cpp)
      c:\program files (x86)\windows kits\10\include\10.0.16299.0\winrt\Windows.ApplicationModel.Contacts.h(7166): error C2447: '{': missing function header (old-style formal list?) (compiling source file Z:\src\qtbase\src\plugins\platforms\windows\qwin10helpers.cpp)
      c:\program files (x86)\windows kits\10\include\10.0.16299.0\winrt\Windows.Security.EnterpriseData.h(2075): error C2146: syntax error: missing '}' before identifier 'DEPRECATEDENUMERATOR' (compiling source file Z:\src\qtbase\src\plugins\platforms\windows\qwin10helpers.cpp)
      c:\program files (x86)\windows kits\10\include\10.0.16299.0\winrt\Windows.Security.EnterpriseData.h(2075): error C2143: syntax error: missing ';' before '<L_TYPE_raw>' (compiling source file Z:\src\qtbase\src\plugins\platforms\windows\qwin10helpers.cpp)
      c:\program files (x86)\windows kits\10\include\10.0.16299.0\winrt\Windows.Security.EnterpriseData.h(2127): error C2143: syntax error: missing ';' before '}' (compiling source file Z:\src\qtbase\src\plugins\platforms\windows\qwin10helpers.cpp)
      c:\program files (x86)\windows kits\10\include\10.0.16299.0\winrt\Windows.Security.EnterpriseData.h(2131): error C2059: syntax error: '}' (compiling source file Z:\src\qtbase\src\plugins\platforms\windows\qwin10helpers.cpp)
      c:\program files (x86)\windows kits\10\include\10.0.16299.0\winrt\Windows.Security.EnterpriseData.h(2131): error C2143: syntax error: missing ';' before '}' (compiling source file Z:\src\qtbase\src\plugins\platforms\windows\qwin10helpers.cpp)
      c:\program files (x86)\windows kits\10\include\10.0.16299.0\winrt\Windows.Security.EnterpriseData.h(2145): error C2143: syntax error: missing ';' before '{' (compiling source file Z:\src\qtbase\src\plugins\platforms\windows\qwin10helpers.cpp)
      c:\program files (x86)\windows kits\10\include\10.0.16299.0\winrt\Windows.Security.EnterpriseData.h(2145): error C2447: '{': missing function header (old-style formal list?) (compiling source file Z:\src\qtbase\src\plugins\platforms\windows\qwin10helpers.cpp)
      c:\program files (x86)\windows kits\10\include\10.0.16299.0\winrt\Windows.Networking.Sockets.h(3127): error C2146: syntax error: missing '}' before identifier 'DEPRECATEDENUMERATOR' (compiling source file Z:\src\qtbase\src\plugins\platforms\windows\qwin10helpers.cpp)
      c:\program files (x86)\windows kits\10\include\10.0.16299.0\winrt\Windows.Networking.Sockets.h(3127): error C2143: syntax error: missing ';' before '<L_TYPE_raw>' (compiling source file Z:\src\qtbase\src\plugins\platforms\windows\qwin10helpers.cpp)
      c:\program files (x86)\windows kits\10\include\10.0.16299.0\winrt\Windows.Networking.Sockets.h(3170): error C2143: syntax error: missing ';' before '}' (compiling source file Z:\src\qtbase\src\plugins\platforms\windows\qwin10helpers.cpp)
      c:\program files (x86)\windows kits\10\include\10.0.16299.0\winrt\Windows.Networking.Sockets.h(3174): error C2059: syntax error: '}' (compiling source file Z:\src\qtbase\src\plugins\platforms\windows\qwin10helpers.cpp)
      c:\program files (x86)\windows kits\10\include\10.0.16299.0\winrt\Windows.Networking.Sockets.h(3174): error C2143: syntax error: missing ';' before '}' (compiling source file Z:\src\qtbase\src\plugins\platforms\windows\qwin10helpers.cpp)
      c:\program files (x86)\windows kits\10\include\10.0.16299.0\winrt\Windows.Networking.Sockets.h(3188): error C2143: syntax error: missing ';' before '{' (compiling source file Z:\src\qtbase\src\plugins\platforms\windows\qwin10helpers.cpp)
      c:\program files (x86)\windows kits\10\include\10.0.16299.0\winrt\Windows.Networking.Sockets.h(3188): error C2447: '{': missing function header (old-style formal list?) (compiling source file Z:\src\qtbase\src\plugins\platforms\windows\qwin10helpers.cpp)
      c:\program files (x86)\windows kits\10\include\10.0.16299.0\winrt\Windows.UI.Notifications.h(3833): error C2146: syntax error: missing '}' before identifier 'DEPRECATEDENUMERATOR' (compiling source file Z:\src\qtbase\src\plugins\platforms\windows\qwin10helpers.cpp)
      c:\program files (x86)\windows kits\10\include\10.0.16299.0\winrt\Windows.UI.Notifications.h(3833): error C2143: syntax error: missing ';' before '<L_TYPE_raw>' (compiling source file Z:\src\qtbase\src\plugins\platforms\windows\qwin10helpers.cpp)
      c:\program files (x86)\windows kits\10\include\10.0.16299.0\winrt\Windows.UI.Notifications.h(4461): error C2143: syntax error: missing ';' before '}' (compiling source file Z:\src\qtbase\src\plugins\platforms\windows\qwin10helpers.cpp)
      c:\program files (x86)\windows kits\10\include\10.0.16299.0\winrt\Windows.UI.Notifications.h(4465): error C2059: syntax error: '}' (compiling source file Z:\src\qtbase\src\plugins\platforms\windows\qwin10helpers.cpp)
      c:\program files (x86)\windows kits\10\include\10.0.16299.0\winrt\Windows.UI.Notifications.h(4465): error C2143: syntax error: missing ';' before '}' (compiling source file Z:\src\qtbase\src\plugins\platforms\windows\qwin10helpers.cpp)
      c:\program files (x86)\windows kits\10\include\10.0.16299.0\winrt\Windows.UI.Notifications.h(4479): error C2143: syntax error: missing ';' before '{' (compiling source file Z:\src\qtbase\src\plugins\platforms\windows\qwin10helpers.cpp)
      c:\program files (x86)\windows kits\10\include\10.0.16299.0\winrt\Windows.UI.Notifications.h(4479): error C2447: '{': missing function header (old-style formal list?) (compiling source file Z:\src\qtbase\src\plugins\platforms\windows\qwin10helpers.cpp)
      c:\program files (x86)\windows kits\10\include\10.0.16299.0\winrt\Windows.Media.Render.h(163): error C2146: syntax error: missing '}' before identifier 'DEPRECATEDENUMERATOR' (compiling source file Z:\src\qtbase\src\plugins\platforms\windows\qwin10helpers.cpp)
      c:\program files (x86)\windows kits\10\include\10.0.16299.0\winrt\Windows.Media.Render.h(163): error C2143: syntax error: missing ';' before '<L_TYPE_raw>' (compiling source file Z:\src\qtbase\src\plugins\platforms\windows\qwin10helpers.cpp)
      c:\program files (x86)\windows kits\10\include\10.0.16299.0\winrt\Windows.Media.Render.h(196): error C2143: syntax error: missing ';' before '}' (compiling source file Z:\src\qtbase\src\plugins\platforms\windows\qwin10helpers.cpp)
      c:\program files (x86)\windows kits\10\include\10.0.16299.0\winrt\Windows.Media.Render.h(200): error C2059: syntax error: '}' (compiling source file Z:\src\qtbase\src\plugins\platforms\windows\qwin10helpers.cpp)
      c:\program files (x86)\windows kits\10\include\10.0.16299.0\winrt\Windows.Media.Render.h(200): error C2143: syntax error: missing ';' before '}' (compiling source file Z:\src\qtbase\src\plugins\platforms\windows\qwin10helpers.cpp)
      c:\program files (x86)\windows kits\10\include\10.0.16299.0\winrt\Windows.Media.Effects.h(269): error C2143: syntax error: missing ';' before '{' (compiling source file Z:\src\qtbase\src\plugins\platforms\windows\qwin10helpers.cpp)
      c:\program files (x86)\windows kits\10\include\10.0.16299.0\winrt\Windows.Media.Effects.h(269): error C2447: '{': missing function header (old-style formal list?) (compiling source file Z:\src\qtbase\src\plugins\platforms\windows\qwin10helpers.cpp)
      c:\program files (x86)\windows kits\10\include\10.0.16299.0\winrt\Windows.Media.Effects.h(902): error C2039: 'IAudioCaptureEffectsManager': is not a member of 'ABI::Windows::Media::Effects' (compiling source file Z:\src\qtbase\src\plugins\platforms\windows\qwin10helpers.cpp)
      c:\program files (x86)\windows kits\10\include\10.0.16299.0\winrt\Windows.Media.Effects.h(886): note: see declaration of 'ABI::Windows::Media::Effects' (compiling source file Z:\src\qtbase\src\plugins\platforms\windows\qwin10helpers.cpp)
      c:\program files (x86)\windows kits\10\include\10.0.16299.0\winrt\Windows.Media.Effects.h(902): error C2065: 'IAudioCaptureEffectsManager': undeclared identifier (compiling source file Z:\src\qtbase\src\plugins\platforms\windows\qwin10helpers.cpp)
      c:\program files (x86)\windows kits\10\include\10.0.16299.0\winrt\Windows.Media.Effects.h(902): error C2059: syntax error: '>' (compiling source file Z:\src\qtbase\src\plugins\platforms\windows\qwin10helpers.cpp)
      c:\program files (x86)\windows kits\10\include\10.0.16299.0\winrt\Windows.Media.Effects.h(903): error C3770: 'unknown-type': is not a valid base class (compiling source file Z:\src\qtbase\src\plugins\platforms\windows\qwin10helpers.cpp)
      c:\program files (x86)\windows kits\10\include\10.0.16299.0\winrt\Windows.ApplicationModel.Background.h(4289): error C2146: syntax error: missing '}' before identifier 'DEPRECATEDENUMERATOR' (compiling source file Z:\src\qtbase\src\plugins\platforms\windows\qwin10helpers.cpp)
      c:\program files (x86)\windows kits\10\include\10.0.16299.0\winrt\Windows.ApplicationModel.Background.h(4289): error C2143: syntax error: missing ';' before '<L_TYPE_raw>' (compiling source file Z:\src\qtbase\src\plugins\platforms\windows\qwin10helpers.cpp)
      c:\program files (x86)\windows kits\10\include\10.0.16299.0\winrt\Windows.ApplicationModel.Background.h(4322): error C2143: syntax error: missing ';' before '}' (compiling source file Z:\src\qtbase\src\plugins\platforms\windows\qwin10helpers.cpp)
      c:\program files (x86)\windows kits\10\include\10.0.16299.0\winrt\Windows.ApplicationModel.Background.h(4326): error C2059: syntax error: '}' (compiling source file Z:\src\qtbase\src\plugins\platforms\windows\qwin10helpers.cpp)
      c:\program files (x86)\windows kits\10\include\10.0.16299.0\winrt\Windows.ApplicationModel.Background.h(4326): error C2143: syntax error: missing ';' before '}' (compiling source file Z:\src\qtbase\src\plugins\platforms\windows\qwin10helpers.cpp)
      c:\program files (x86)\windows kits\10\include\10.0.16299.0\winrt\Windows.ApplicationModel.Background.h(4340): error C2143: syntax error: missing ';' before '{' (compiling source file Z:\src\qtbase\src\plugins\platforms\windows\qwin10helpers.cpp)
      c:\program files (x86)\windows kits\10\include\10.0.16299.0\winrt\Windows.ApplicationModel.Background.h(4340): error C2447: '{': missing function header (old-style formal list?) (compiling source file Z:\src\qtbase\src\plugins\platforms\windows\qwin10helpers.cpp)
      jom: Z:\build\5.12.9-windows-x86_64-msvc2019_vc141\qtbase\src\plugins\platforms\windows\Makefile.Debug [.obj\debug\qwin10helpers.obj] Error 2
      

        Attachments

        No reviews matched the request. Check your Options in the drop-down menu of this sections header.

          Activity

            People

            Assignee:
            thiago Thiago Macieira
            Reporter:
            dmitry.sokolov Dmitry Sokolov
            Votes:
            0 Vote for this issue
            Watchers:
            2 Start watching this issue

              Dates

              Created:
              Updated:
              Resolved:

                Gerrit Reviews

                There are no open Gerrit changes