Uploaded image for project: 'Qt'
  1. Qt
  2. QTBUG-85897

qtopcua build failure in qt5.git integration

    XMLWordPrintable

    Details

    • Type: Bug
    • Status: Closed
    • Priority: P0: Blocker
    • Resolution: Invalid
    • Affects Version/s: 6.0.0 Alpha
    • Fix Version/s: None
    • Component/s: OpcUA
    • Labels:
      None

      Description

      /include/QtCore -I.moc -I/home/qt/work/install/mkspecs/linux-g++ -o .obj/qopen62541subscription.o qopen62541subscription.cpp
      agent:2020/08/05 11:11:20 build.go:264: /usr/lib64/gcc/x86_64-suse-linux/7/../../../../x86_64-suse-linux/bin/ld: cannot find -lQt6::QXcbIntegrationPlugin
      agent:2020/08/05 11:11:20 build.go:264: /usr/lib64/gcc/x86_64-suse-linux/7/../../../../x86_64-suse-linux/bin/ld: cannot find -lQt6::QXcbEglIntegrationPlugin
      agent:2020/08/05 11:11:20 build.go:264: /usr/lib64/gcc/x86_64-suse-linux/7/../../../../x86_64-suse-linux/bin/ld: cannot find -lQt6::QXcbGlxIntegrationPlugin
      agent:2020/08/05 11:11:20 build.go:264: /usr/lib64/gcc/x86_64-suse-linux/7/../../../../x86_64-suse-linux/bin/ld: cannot find -lQt6::QEglFSX11IntegrationPlugin
      agent:2020/08/05 11:11:20 build.go:264: /usr/lib64/gcc/x86_64-suse-linux/7/../../../../x86_64-suse-linux/bin/ld: cannot find -lQt6::QEglFSKmsEglDeviceIntegrationPlugin
      agent:2020/08/05 11:11:20 build.go:264: /usr/lib64/gcc/x86_64-suse-linux/7/../../../../x86_64-suse-linux/bin/ld: cannot find -lQt6::QEglFSEmulatorIntegrationPlugin
      agent:2020/08/05 11:11:20 build.go:264: /usr/lib64/gcc/x86_64-suse-linux/7/../../../../x86_64-suse-linux/bin/ld: cannot find -lQt6::QComposePlatformInputContextPlugin
      agent:2020/08/05 11:11:20 build.go:264: /usr/lib64/gcc/x86_64-suse-linux/7/../../../../x86_64-suse-linux/bin/ld: cannot find -lQt6::QIbusPlatformInputContextPlugin
      agent:2020/08/05 11:11:20 build.go:264: /usr/lib64/gcc/x86_64-suse-linux/7/../../../../x86_64-suse-linux/bin/ld: cannot find -lQt6::QXdgDesktopPortalThemePlugin
      agent:2020/08/05 11:11:20 build.go:264: /usr/lib64/gcc/x86_64-suse-linux/7/../../../../x86_64-suse-linux/bin/ld: cannot find -lQt6::QICOPlugin
      agent:2020/08/05 11:11:20 build.go:264: /usr/lib64/gcc/x86_64-suse-linux/7/../../../../x86_64-suse-linux/bin/ld: cannot find -lQt6::QJpegPlugin
      agent:2020/08/05 11:11:20 build.go:264: /usr/lib64/gcc/x86_64-suse-linux/7/../../../../x86_64-suse-linux/bin/ld: cannot find -lQt6::QGifPlugin
      agent:2020/08/05 11:11:20 build.go:264: /usr/lib64/gcc/x86_64-suse-linux/7/../../../../x86_64-suse-linux/bin/ld: cannot find -lQt6::QEvdevMousePlugin
      agent:2020/08/05 11:11:20 build.go:264: /usr/lib64/gcc/x86_64-suse-linux/7/../../../../x86_64-suse-linux/bin/ld: cannot find -lQt6::QEvdevTouchScreenPlugin
      agent:2020/08/05 11:11:20 build.go:264: /usr/lib64/gcc/x86_64-suse-linux/7/../../../../x86_64-suse-linux/bin/ld: cannot find -lQt6::QEvdevKeyboardPlugin
      agent:2020/08/05 11:11:20 build.go:264: /usr/lib64/gcc/x86_64-suse-linux/7/../../../../x86_64-suse-linux/bin/ld: cannot find -lQt6::QEvdevTabletPlugin
      agent:2020/08/05 11:11:20 build.go:264: /usr/lib64/gcc/x86_64-suse-linux/7/../../../../x86_64-suse-linux/bin/ld: cannot find -lQt6::QTuioTouchPlugin
      agent:2020/08/05 11:11:20 build.go:264: collect2: error: ld returned 1 exit status
      agent:2020/08/05 11:11:20 build.go:264: make[5]: *** [Makefile:79: basic] Error 1
      agent:2020/08/05 11:11:20 build.go:264: make[5]: Leaving directory '/home/qt/work/qt/qtopcua/src/imports/doc/snippets/basic'
      agent:2020/08/05 11:11:20 build.go:264: make[4]: *** [Makefile:47: sub-basic-make_first] Error 2
      agent:2020/08/05 11:11:20 build.go:264: make[4]: Leaving directory '/home/qt/work/qt/qtopcua/src/imports/doc/snippets'
      agent:2020/08/05 11:11:20 build.go:264: make[3]: *** [Makefile:47: sub-snippets-make_first] Error 2
      agent:2020/08/05 11:11:20 build.go:264: make[3]: Leaving directory '/home/qt/work/qt/qtopcua/src/imports/doc'
      agent:2020/08/05 11:11:20 build.go:264: make[2]: *** [Makefile:48: sub-doc-make_first] Error 2
      agent:2020/08/05 11:11:20 build.go:264: make[2]: *** Waiting for unfinished jobs....

      Log: http://coin-master.ci.qt.io/coin/api/results/qt/qtopcua/953bd8356f0e8f2bd6e6044edbb277b110f05932/LinuxopenSUSE_15_1x86_64LinuxopenSUSE_15_1x86_64GCCqtci-linux-openSUSE-15.1-x86_64-9f3412/7c0516064787feabab0de2aac90071eef3145b1c/build_1596625393/log.txt.gz

      Details: http://coin-master.ci.qt.io/coin/integration/qt/tqtc-qt5/tasks/web_qt_tqtc-qt5_1596625227973

        Attachments

        No reviews matched the request. Check your Options in the drop-down menu of this sections header.

          Activity

            People

            Assignee:
            fmeerkoetter Frank Meerkötter
            Reporter:
            janihe Jani Heikkinen
            Votes:
            0 Vote for this issue
            Watchers:
            4 Start watching this issue

              Dates

              Created:
              Updated:
              Resolved:

                Gerrit Reviews

                There are no open Gerrit changes