Uploaded image for project: 'Qt'
  1. Qt
  2. QTBUG-85930

Update dependencies failed on 'dev' in qt/qtnetworkauth

    XMLWordPrintable

    Details

    • Type: Bug
    • Status: Closed
    • Priority: P0: Blocker
    • Resolution: Done
    • Affects Version/s: 6.0.0 Alpha
    • Fix Version/s: 6.0.0
    • Labels:
      None
    • Story Points:
      5
    • Commits:
      e0036577b4584e1edd4eb3b6dfea56899e41be8c
    • Sprint:
      Qt6_Foundation_Sprint 15

      Description

      Qt CI Bot

      Continuous Integration: Failed

      Running make failed. The CI rejected the staged commits due to the beforementioned reason. Possible reason could be a bug in one of the commits or some more recent change. Please investigate it.
      
      The error was in "qt/qtnetworkauth", revision: 8a8c365e4fcd181008f78af28b0e85c556d4198a
       
       153: QtNetworkAuth: created master header
       QtNetworkAuth: created headers.pri file
       make[2]: Entering directory '/home/qt/work/qt/qtnetworkauth/src/oauth'
       perl /home/qt/work/install/mkspecs/features/data/unix/findclasslist.pl < QtNetworkAuth.version.in > QtNetworkAuth.version
       g++ -pipe -O2 -g -std=c++1z -fvisibility=hidden -fvisibility-inlines-hidden -fno-exceptions -Wall -Wextra -Wvla -Wdate-time -Wshift-overflow=2 -Wduplicated-cond -Wno-stringop-overflow -Wno-format-overflow -Wsuggest-override -D_REENTRANT -fPIC -DQT_NO_FOREACH -DQT_NO_JAVA_STYLE_ITERATORS -DQT_NO_NARROWING_CONVERSIONS_IN_CONNECT -DQT_BUILD_NETWORKAUTH_LIB -DQT_BUILDING_QT -DQT_NO_CAST_TO_ASCII -DQT_ASCII_CAST_WARNINGS -DQT_MOC_COMPAT -DQT_USE_QSTRINGBUILDER -DQT_DEPRECATED_WARNINGS -DQT_DISABLE_DEPRECATED_BEFORE=0x050000 -DQT_DEPRECATED_WARNINGS_SINCE=0x060000 -DQT_NO_EXCEPTIONS -D_LARGEFILE64_SOURCE -D_LARGEFILE_SOURCE -DQT_NO_DEBUG -DQT_NETWORK_LIB -DQT_CORE_LIB -I. -I../../include -I../../include/QtNetworkAuth -I../../include/QtNetworkAuth/6.0.0 -I../../include/QtNetworkAuth/6.0.0/QtNetworkAuth -I/home/qt/work/install/include/QtCore/6.0.0 -I/home/qt/work/install/include/QtCore/6.0.0/QtCore -I/home/qt/work/install/include -I/home/qt/work/install/include/QtNetwork -I/home/qt/work/install/include/QtCore -I.moc -I/home/qt/openssl-1.1.1g/include -I/home/qt/work/install/mkspecs/linux-g++ -x c++-header -c ../../include/QtNetworkAuth/QtNetworkAuthDepends -o .pch/Qt6NetworkAuth.gch/c++
       g++ -c -include .pch/Qt6NetworkAuth -pipe -O2 -g -std=c++1z -fvisibility=hidden -fvisibility-inlines-hidden -fno-exceptions -Wall -Wextra -Wvla -Wdate-time -Wshift-overflow=2 -Wduplicated-cond -Wno-stringop-overflow -Wno-format-overflow -Wsuggest-override -D_REENTRANT -fPIC -DQT_NO_FOREACH -DQT_NO_JAVA_STYLE_ITERATORS -DQT_NO_NARROWING_CONVERSIONS_IN_CONNECT -DQT_BUILD_NETWORKAUTH_LIB -DQT_BUILDING_QT -DQT_NO_CAST_TO_ASCII -DQT_ASCII_CAST_WARNINGS -DQT_MOC_COMPAT -DQT_USE_QSTRINGBUILDER -DQT_DEPRECATED_WARNINGS -DQT_DISABLE_DEPRECATED_BEFORE=0x050000 -DQT_DEPRECATED_WARNINGS_SINCE=0x060000 -DQT_NO_EXCEPTIONS -D_LARGEFILE64_SOURCE -D_LARGEFILE_SOURCE -DQT_NO_DEBUG -DQT_NETWORK_LIB -DQT_CORE_LIB -I. -I../../include -I../../include/QtNetworkAuth -I../../include/QtNetworkAuth/6.0.0 -I../../include/QtNetworkAuth/6.0.0/QtNetworkAuth -I/home/qt/work/install/include/QtCore/6.0.0 -I/home/qt/work/install/include/QtCore/6.0.0/QtCore -I/home/qt/work/install/include -I/home/qt/work/install/include/QtNetwork -I/home/qt/work/install/include/QtCore -I.moc -I/home/qt/openssl-1.1.1g/include -I/home/qt/work/install/mkspecs/linux-g++ -o .obj/qoauth1.o qoauth1.cpp
       g++ -c -include .pch/Qt6NetworkAuth -pipe -O2 -g -std=c++1z -fvisibility=hidden -fvisibility-inlines-hidden -fno-exceptions -Wall -Wextra -Wvla -Wdate-time -Wshift-overflow=2 -Wduplicated-cond -Wno-stringop-overflow -Wno-format-overflow -Wsuggest-override -D_REENTRANT -fPIC -DQT_NO_FOREACH -DQT_NO_JAVA_STYLE_ITERATORS -DQT_NO_NARROWING_CONVERSIONS_IN_CONNECT -DQT_BUILD_NETWORKAUTH_LIB -DQT_BUILDING_QT -DQT_NO_CAST_TO_ASCII -DQT_ASCII_CAST_WARNINGS -DQT_MOC_COMPAT -DQT_USE_QSTRINGBUILDER -DQT_DEPRECATED_WARNINGS -DQT_DISABLE_DEPRECATED_BEFORE=0x050000 -DQT_DEPRECATED_WARNINGS_SINCE=0x060000 -DQT_NO_EXCEPTIONS -D_LARGEFILE64_SOURCE -D_LARGEFILE_SOURCE -DQT_NO_DEBUG -DQT_NETWORK_LIB -DQT_CORE_LIB -I. -I../../include -I../../include/QtNetworkAuth -I../../include/QtNetworkAuth/6.0.0 -I../../include/QtNetworkAuth/6.0.0/QtNetworkAuth -I/home/qt/work/install/include/QtCore/6.0.0 -I/home/qt/work/install/include/QtCore/6.0.0/QtCore -I/home/qt/work/install/include -I/home/qt/work/install/include/QtNetwork -I/home/qt/work/install/include/QtCore -I.moc -I/home/qt/openssl-1.1.1g/include -I/home/qt/work/install/mkspecs/linux-g++ -o .obj/qabstractoauth.o qabstractoauth.cpp
       g++ -c -include .pch/Qt6NetworkAuth -pipe -O2 -g -std=c++1z -fvisibility=hidden -fvisibility-inlines-hidden -fno-exceptions -Wall -Wextra -Wvla -Wdate-time -Wshift-overflow=2 -Wduplicated-cond -Wno-stringop-overflow -Wno-format-overflow -Wsuggest-override -D_REENTRANT -fPIC -DQT_NO_FOREACH -DQT_NO_JAVA_STYLE_ITERATORS -DQT_NO_NARROWING_CONVERSIONS_IN_CONNECT -DQT_BUILD_NETWORKAUTH_LIB -DQT_BUILDING_QT -DQT_NO_CAST_TO_ASCII -DQT_ASCII_CAST_WARNINGS -DQT_MOC_COMPAT -DQT_USE_QSTRINGBUILDER -DQT_DEPRECATED_WARNINGS -DQT_DISABLE_DEPRECATED_BEFORE=0x050000 -DQT_DEPRECATED_WARNINGS_SINCE=0x060000 -DQT_NO_EXCEPTIONS -D_LARGEFILE64_SOURCE -D_LARGEFILE_SOURCE -DQT_NO_DEBUG -DQT_NETWORK_LIB -DQT_CORE_LIB -I. -I../../include -I../../include/QtNetworkAuth -I../../include/QtNetworkAuth/6.0.0 -I../../include/QtNetworkAuth/6.0.0/QtNetworkAuth -I/home/qt/work/install/include/QtCore/6.0.0 -I/home/qt/work/install/include/QtCore/6.0.0/QtCore -I/home/qt/work/install/include -I/home/qt/work/install/include/QtNetwork -I/home/qt/work/install/include/QtCore -I.moc -I/home/qt/openssl-1.1.1g/include -I/home/qt/work/install/mkspecs/linux-g++ -o .obj/qabstractoauth2.o qabstractoauth2.cpp
       g++ -c -include .pch/Qt6NetworkAuth -pipe -O2 -g -std=c++1z -fvisibility=hidden -fvisibility-inlines-hidden -fno-exceptions -Wall -Wextra -Wvla -Wdate-time -Wshift-overflow=2 -Wduplicated-cond -Wno-stringop-overflow -Wno-format-overflow -Wsuggest-override -D_REENTRANT -fPIC -DQT_NO_FOREACH -DQT_NO_JAVA_STYLE_ITERATORS -DQT_NO_NARROWING_CONVERSIONS_IN_CONNECT -DQT_BUILD_NETWORKAUTH_LIB -DQT_BUILDING_QT -DQT_NO_CAST_TO_ASCII -DQT_ASCII_CAST_WARNINGS -DQT_MOC_COMPAT -DQT_USE_QSTRINGBUILDER -DQT_DEPRECATED_WARNINGS -DQT_DISABLE_DEPRECATED_BEFORE=0x050000 -DQT_DEPRECATED_WARNINGS_SINCE=0x060000 -DQT_NO_EXCEPTIONS -D_LARGEFILE64_SOURCE -D_LARGEFILE_SOURCE -DQT_NO_DEBUG -DQT_NETWORK_LIB -DQT_CORE_LIB -I. -I../../include -I../../include/QtNetworkAuth -I../../include/QtNetworkAuth/6.0.0 -I../../include/QtNetworkAuth/6.0.0/QtNetworkAuth -I/home/qt/work/install/include/QtCore/6.0.0 -I/home/qt/work/install/include/QtCore/6.0.0/QtCore -I/home/qt/work/install/include -I/home/qt/work/install/include/QtNetwork -I/home/qt/work/install/include/QtCore -I.moc -I/home/qt/openssl-1.1.1g/include -I/home/qt/work/install/mkspecs/linux-g++ -o .obj/qoauth1signature.o qoauth1signature.cpp
       qoauth1signature.cpp: In constructor ‘QOAuth1SignaturePrivate::QOAuth1SignaturePrivate(const QUrl&, QOAuth1Signature::HttpRequestMethod, const QVariantMap&, const QString&, const QString&)’:
       qoauth1signature.cpp:105:26: error: no matching function for call to ‘QMultiMap<QString, QVariant>::QMultiMap(const QVariantMap&)’
       
       189:   766 |     constexpr QMultiMap() noexcept {}
             |               ^~~~~~~~~
       /home/qt/work/install/include/QtCore/qmap.h:766:15: note:   candidate expects 0 arguments, 1 provided
       /home/qt/work/install/include/QtCore/qmap.h:755:7: note: candidate: ‘QMultiMap<QString, QVariant>::QMultiMap(const QMultiMap<QString, QVariant>&)’
         755 | class QMultiMap
             |       ^~~~~~~~~
       /home/qt/work/install/include/QtCore/qmap.h:755:7: note:   no known conversion for argument 1 from ‘const QVariantMap’ {aka ‘const QMap<QString, QVariant>’} to ‘const QMultiMap<QString, QVariant>&’
       /home/qt/work/install/include/QtCore/qmap.h:755:7: note: candidate: ‘QMultiMap<QString, QVariant>::QMultiMap(QMultiMap<QString, QVariant>&&)’
       /home/qt/work/install/include/QtCore/qmap.h:755:7: note:   no known conversion for argument 1 from ‘const QVariantMap’ {aka ‘const QMap<QString, QVariant>’} to ‘QMultiMap<QString, QVariant>&&’
       qoauth1signature.cpp: In member function ‘QByteArray QOAuth1SignaturePrivate::signatureBaseString() const’:
       qoauth1signature.cpp:143:21: error: conversion from ‘const QMultiMap<QString, QVariant>’ to non-scalar type ‘QVariantMap’ {aka ‘QMap<QString, QVariant>’} requested
       
       193:   755 | class QMultiMap
             |       ^~~~~~~~~
       /home/qt/work/install/include/QtCore/qmap.h:755:7: note:   no known conversion for argument 1 from ‘const QVariantMap’ {aka ‘const QMap<QString, QVariant>’} to ‘const QMultiMap<QString, QVariant>&’
       /home/qt/work/install/include/QtCore/qmap.h:755:7: note: candidate: ‘QMultiMap<QString, QVariant>::QMultiMap(QMultiMap<QString, QVariant>&&)’
       /home/qt/work/install/include/QtCore/qmap.h:755:7: note:   no known conversion for argument 1 from ‘const QVariantMap’ {aka ‘const QMap<QString, QVariant>’} to ‘QMultiMap<QString, QVariant>&&’
       qoauth1signature.cpp: In member function ‘QByteArray QOAuth1SignaturePrivate::signatureBaseString() const’:
       qoauth1signature.cpp:143:21: error: conversion from ‘const QMultiMap<QString, QVariant>’ to non-scalar type ‘QVariantMap’ {aka ‘QMap<QString, QVariant>’} requested
         143 |     QVariantMap p = parameters;
             |                     ^~~~~~~~~~
       qoauth1signature.cpp: In member function ‘QVariantMap QOAuth1Signature::parameters() const’:
       qoauth1signature.cpp:305:15: error: could not convert ‘((const QOAuth1Signature*)this)->QOAuth1Signature::d.QSharedDataPointer<QOAuth1SignaturePrivate>::operator->()->QOAuth1SignaturePrivate::parameters’ from ‘const QMultiMap<QString, QVariant>’ to ‘QVariantMap’ {aka ‘QMap<QString, QVariant>’}
       
       199: qoauth1signature.cpp:143:21: error: conversion from ‘const QMultiMap<QString, QVariant>’ to non-scalar type ‘QVariantMap’ {aka ‘QMap<QString, QVariant>’} requested
         143 |     QVariantMap p = parameters;
             |                     ^~~~~~~~~~
       qoauth1signature.cpp: In member function ‘QVariantMap QOAuth1Signature::parameters() const’:
       qoauth1signature.cpp:305:15: error: could not convert ‘((const QOAuth1Signature*)this)->QOAuth1Signature::d.QSharedDataPointer<QOAuth1SignaturePrivate>::operator->()->QOAuth1SignaturePrivate::parameters’ from ‘const QMultiMap<QString, QVariant>’ to ‘QVariantMap’ {aka ‘QMap<QString, QVariant>’}
         305 |     return d->parameters;
             |            ~~~^~~~~~~~~~
             |               |
             |               const QMultiMap<QString, QVariant>
       qoauth1.cpp: In member function ‘void QOAuth1Private::appendSignature(QAbstractOAuth::Stage, QVariantMap*, const QUrl&, QNetworkAccessManager::Operation, QVariantMap)’:
       qoauth1.cpp:147:51: error: conversion from ‘QVariantMap’ {aka ‘QMap<QString, QVariant>’} to non-scalar type ‘QMultiMap<QString, QVariant>’ requested
       
       202: qoauth1signature.cpp: In member function ‘QVariantMap QOAuth1Signature::parameters() const’:
       qoauth1signature.cpp:305:15: error: could not convert ‘((const QOAuth1Signature*)this)->QOAuth1Signature::d.QSharedDataPointer<QOAuth1SignaturePrivate>::operator->()->QOAuth1SignaturePrivate::parameters’ from ‘const QMultiMap<QString, QVariant>’ to ‘QVariantMap’ {aka ‘QMap<QString, QVariant>’}
         305 |     return d->parameters;
             |            ~~~^~~~~~~~~~
             |               |
             |               const QMultiMap<QString, QVariant>
       qoauth1.cpp: In member function ‘void QOAuth1Private::appendSignature(QAbstractOAuth::Stage, QVariantMap*, const QUrl&, QNetworkAccessManager::Operation, QVariantMap)’:
       qoauth1.cpp:147:51: error: conversion from ‘QVariantMap’ {aka ‘QMap<QString, QVariant>’} to non-scalar type ‘QMultiMap<QString, QVariant>’ requested
         147 |         QMultiMap<QString, QVariant> headerCopy = *headers;
             |                                                   ^~~~~~~~
       qoauth1.cpp:148:54: error: cannot convert ‘const QVariantMap’ {aka ‘const QMap<QString, QVariant>’} to ‘const QMultiMap<QString, QVariant>&’
       
       215:       |                                                      |
             |                                                      const QVariantMap {aka const QMap<QString, QVariant>}
       In file included from /home/qt/work/install/include/QtCore/qvariant.h:47,
                        from /home/qt/work/install/include/QtCore/qabstractitemmodel.h:46,
                        from /home/qt/work/install/include/QtCore/QtCore:10,
                        from ../../include/QtNetworkAuth/QtNetworkAuthDepends:3:
       /home/qt/work/install/include/QtCore/qmap.h:1365:39: note:   initializing argument 1 of ‘QMultiMap<Key, T>& QMultiMap<Key, T>::unite(const QMultiMap<Key, T>&) [with Key = QString; T = QVariant]’
        1365 |     QMultiMap &unite(const QMultiMap &other)
             |                      ~~~~~~~~~~~~~~~~~^~~~~
       qoauth1.cpp: In member function ‘void QOAuth1::setup(QNetworkRequest*, const QVariantMap&, QNetworkAccessManager::Operation)’:
       qoauth1.cpp:767:65: error: no matching function for call to ‘QMultiMap<QString, QVariant>::QMultiMap(QMap<QString, QVariant>&)’
       
       250: /home/qt/work/install/include/QtCore/qmap.h:766:15: note: candidate: ‘constexpr QMultiMap<Key, T>::QMultiMap() [with Key = QString; T = QVariant]’
         766 |     constexpr QMultiMap() noexcept {}
             |               ^~~~~~~~~
       /home/qt/work/install/include/QtCore/qmap.h:766:15: note:   candidate expects 0 arguments, 1 provided
       /home/qt/work/install/include/QtCore/qmap.h:755:7: note: candidate: ‘QMultiMap<QString, QVariant>::QMultiMap(const QMultiMap<QString, QVariant>&)’
         755 | class QMultiMap
             |       ^~~~~~~~~
       /home/qt/work/install/include/QtCore/qmap.h:755:7: note:   no known conversion for argument 1 from ‘QMap<QString, QVariant>’ to ‘const QMultiMap<QString, QVariant>&’
       /home/qt/work/install/include/QtCore/qmap.h:755:7: note: candidate: ‘QMultiMap<QString, QVariant>::QMultiMap(QMultiMap<QString, QVariant>&&)’
       /home/qt/work/install/include/QtCore/qmap.h:755:7: note:   no known conversion for argument 1 from ‘QMap<QString, QVariant>’ to ‘QMultiMap<QString, QVariant>&&’
       qoauth1.cpp:768:55: error: cannot convert ‘const QVariantMap’ {aka ‘const QMap<QString, QVariant>’} to ‘const QMultiMap<QString, QVariant>&’
       
       263:       |                                                       |
             |                                                       const QVariantMap {aka const QMap<QString, QVariant>}
       In file included from /home/qt/work/install/include/QtCore/qvariant.h:47,
                        from /home/qt/work/install/include/QtCore/qabstractitemmodel.h:46,
                        from /home/qt/work/install/include/QtCore/QtCore:10,
                        from ../../include/QtNetworkAuth/QtNetworkAuthDepends:3:
       /home/qt/work/install/include/QtCore/qmap.h:1365:39: note:   initializing argument 1 of ‘QMultiMap<Key, T>& QMultiMap<Key, T>::unite(const QMultiMap<Key, T>&) [with Key = QString; T = QVariant]’
        1365 |     QMultiMap &unite(const QMultiMap &other)
             |                      ~~~~~~~~~~~~~~~~~^~~~~
       qoauth1.cpp: In member function ‘void QOAuth1::setup(QNetworkRequest*, const QVariantMap&, const QByteArray&)’:
       qoauth1.cpp:808:65: error: no matching function for call to ‘QMultiMap<QString, QVariant>::QMultiMap(QMap<QString, QVariant>&)’
       
       298: /home/qt/work/install/include/QtCore/qmap.h:766:15: note: candidate: ‘constexpr QMultiMap<Key, T>::QMultiMap() [with Key = QString; T = QVariant]’
         766 |     constexpr QMultiMap() noexcept {}
             |               ^~~~~~~~~
       /home/qt/work/install/include/QtCore/qmap.h:766:15: note:   candidate expects 0 arguments, 1 provided
       /home/qt/work/install/include/QtCore/qmap.h:755:7: note: candidate: ‘QMultiMap<QString, QVariant>::QMultiMap(const QMultiMap<QString, QVariant>&)’
         755 | class QMultiMap
             |       ^~~~~~~~~
       /home/qt/work/install/include/QtCore/qmap.h:755:7: note:   no known conversion for argument 1 from ‘QMap<QString, QVariant>’ to ‘const QMultiMap<QString, QVariant>&’
       /home/qt/work/install/include/QtCore/qmap.h:755:7: note: candidate: ‘QMultiMap<QString, QVariant>::QMultiMap(QMultiMap<QString, QVariant>&&)’
       /home/qt/work/install/include/QtCore/qmap.h:755:7: note:   no known conversion for argument 1 from ‘QMap<QString, QVariant>’ to ‘QMultiMap<QString, QVariant>&&’
       qoauth1.cpp:809:55: error: cannot convert ‘const QVariantMap’ {aka ‘const QMap<QString, QVariant>’} to ‘const QMultiMap<QString, QVariant>&’
       
       311:       |                                                       |
             |                                                       const QVariantMap {aka const QMap<QString, QVariant>}
       In file included from /home/qt/work/install/include/QtCore/qvariant.h:47,
                        from /home/qt/work/install/include/QtCore/qabstractitemmodel.h:46,
                        from /home/qt/work/install/include/QtCore/QtCore:10,
                        from ../../include/QtNetworkAuth/QtNetworkAuthDepends:3:
       /home/qt/work/install/include/QtCore/qmap.h:1365:39: note:   initializing argument 1 of ‘QMultiMap<Key, T>& QMultiMap<Key, T>::unite(const QMultiMap<Key, T>&) [with Key = QString; T = QVariant]’
        1365 |     QMultiMap &unite(const QMultiMap &other)
             |                      ~~~~~~~~~~~~~~~~~^~~~~
       Makefile:1677: recipe for target '.obj/qoauth1.o' failed
       make[2]: *** [.obj/qoauth1.o] Error 1
       
       314:                  from /home/qt/work/install/include/QtCore/qabstractitemmodel.h:46,
                        from /home/qt/work/install/include/QtCore/QtCore:10,
                        from ../../include/QtNetworkAuth/QtNetworkAuthDepends:3:
       /home/qt/work/install/include/QtCore/qmap.h:1365:39: note:   initializing argument 1 of ‘QMultiMap<Key, T>& QMultiMap<Key, T>::unite(const QMultiMap<Key, T>&) [with Key = QString; T = QVariant]’
        1365 |     QMultiMap &unite(const QMultiMap &other)
             |                      ~~~~~~~~~~~~~~~~~^~~~~
       Makefile:1677: recipe for target '.obj/qoauth1.o' failed
       make[2]: *** [.obj/qoauth1.o] Error 1
       make[2]: *** Waiting for unfinished jobs....
       Makefile:2048: recipe for target '.obj/qoauth1signature.o' failed
       make[2]: *** [.obj/qoauth1signature.o] Error 1
       
       317: /home/qt/work/install/include/QtCore/qmap.h:1365:39: note:   initializing argument 1 of ‘QMultiMap<Key, T>& QMultiMap<Key, T>::unite(const QMultiMap<Key, T>&) [with Key = QString; T = QVariant]’
        1365 |     QMultiMap &unite(const QMultiMap &other)
             |                      ~~~~~~~~~~~~~~~~~^~~~~
       Makefile:1677: recipe for target '.obj/qoauth1.o' failed
       make[2]: *** [.obj/qoauth1.o] Error 1
       make[2]: *** Waiting for unfinished jobs....
       Makefile:2048: recipe for target '.obj/qoauth1signature.o' failed
       make[2]: *** [.obj/qoauth1signature.o] Error 1
       make[2]: Leaving directory '/home/qt/work/qt/qtnetworkauth/src/oauth'
       Makefile:46: recipe for target 'sub-oauth-make_first-ordered' failed
       make[1]: *** [sub-oauth-make_first-ordered] Error 2
       
       326: Makefile:46: recipe for target 'sub-oauth-make_first-ordered' failed
       make[1]: *** [sub-oauth-make_first-ordered] Error 2
       make[1]: Leaving directory '/home/qt/work/qt/qtnetworkauth/src'
       Makefile:48: recipe for target 'sub-src-make_first' failed
       make: *** [sub-src-make_first] Error 2
       Process finished with error: exit status 2
       Executing scheduled instruction 1 of 1 - Upload all core dumps if there are some
       Skip uploading core files because CORE_FILES_PATH is not set in the environment
       agent:2020/08/07 01:55:36 build.go:545:
       Build failed
       ERROR building: exit status 2
      

      Build log: https://testresults.qt.io/logs/qt/qtnetworkauth/f20b42e3d3e94ff2ba1d060fddd891d9d203adaf/LinuxUbuntu_18_04x86_64LinuxUbuntu_18_04x86_64GCCqtci-linux-Ubuntu-18.04-x86_64-a4895eUseLegacyInstructions/614852c07e618bbc9b1f00230716e42da28acf7b/build_1596766991/log.txt.gz

      Details: https://testresults.qt.io/coin/integration/qt/qtnetworkauth/tasks/1596766987
      Tested changes (refs/builds/qtci/dev/1596764840):
      https://codereview.qt-project.org/c/qt/qtnetworkauth/+/309590/1 Update dependencies on 'dev' in qt/qtnetworkauth

        Attachments

        For Gerrit Dashboard: QTBUG-85930
        # Subject Branch Project Status CR V

          Activity

            People

            Assignee:
            manordheim Mårten Nordheim
            Reporter:
            janihe Jani Heikkinen
            PM Owner:
            Maurice Kalinowski Maurice Kalinowski
            RnD Owner:
            Alex Blasche Alex Blasche
            Votes:
            0 Vote for this issue
            Watchers:
            6 Start watching this issue

              Dates

              Created:
              Updated:
              Resolved:

                Gerrit Reviews

                There are no open Gerrit changes