Uploaded image for project: 'Qt'
  1. Qt
  2. QTBUG-86504

Broken filename passed to function

    XMLWordPrintable

    Details

    • Type: Bug
    • Status: Closed
    • Priority: P0: Blocker
    • Resolution: Done
    • Affects Version/s: 6.0.0 Alpha
    • Fix Version/s: 6.0.0 Alpha
    • Component/s: Wayland Compositor
    • Labels:
      None
    • Platform/s:
      Linux/Yocto
    • Commits:
      c4dbd1cddca21b5fec8b8ffdc971b895b156f33f

      Description

      agent:2020/09/04 10:30:00 build.go:302: cd iviapplication/ && ( test -e Makefile || /home/qt/work/install/bin/qmake -o Makefile /home/qt/work/qt/qtwayland/src/imports/compositor-extensions/iviapplication/iviapplication.pro INSTALL_PREFIX=/home/qt/work/install ) && make -f Makefile 
      agent:2020/09/04 10:30:00 build.go:302: Broken filename passed to function
      agent:2020/09/04 10:30:00 build.go:302: Broken filename passed to function
      agent:2020/09/04 10:30:00 build.go:302: Broken filename passed to function
      agent:2020/09/04 10:30:00 build.go:302: WARNING: DESTDIR: Cannot access directory '../../../../qml/QtWayland/Compositor/IviApplication'
      agent:2020/09/04 10:30:00 build.go:302: Broken filename passed to function
      agent:2020/09/04 10:30:00 build.go:302: make[4]: Entering directory '/home/qt/work/qt/qtwayland/src/imports/compositor-extensions/iviapplication'
      agent:2020/09/04 10:30:00 build.go:302: Makefile:79: *** missing separator.  Stop.
      agent:2020/09/04 10:30:00 build.go:302: make[4]: Leaving directory '/home/qt/work/qt/qtwayland/src/imports/compositor-extensions/iviapplication'
      agent:2020/09/04 10:30:00 build.go:302: make[3]: *** [Makefile:74: sub-iviapplication-make_first] Error 2
      agent:2020/09/04 10:30:00 build.go:302: make[3]: Leaving directory '/home/qt/work/qt/qtwayland/src/imports/compositor-extensions'
      agent:2020/09/04 10:30:00 build.go:302: make[2]: *** [Makefile:75: sub-compositor-extensions-make_first] Error 2
      agent:2020/09/04 10:30:00 build.go:302: make[2]: Leaving directory '/home/qt/work/qt/qtwayland/src/imports'
      agent:2020/09/04 10:30:00 build.go:302: make[1]: *** [Makefile:154: sub-imports-make_first] Error 2
      agent:2020/09/04 10:30:00 build.go:302: make[1]: *** Waiting for unfinished jobs....
      

      Build log: https://testresults.qt.io/logs/qt/qtwayland/cd0a87ea48356dcc9148c5c1b03eb7eeacbbd91b/LinuxUbuntu_20_04x86_64LinuxQEMUmips64GCCqtci-linux-Ubuntu-20.04-x86_64-50-3e396dDisableTests_UseLegacyInstructions/29d4bc61887c561cf11a9ad55ed51182d10f2b2f/build_1599214971/log.txt.gz*

      Details: https://testresults.qt.io/coin/integration/qt/qtwayland/tasks/1599214726

      Tested changes (refs/builds/qtci/dev/1599214724):
      https://codereview.qt-project.org/c/qt/qtwayland/+/312733/1 Update dependencies on 'dev' in qt/qtwayland

        Attachments

        No reviews matched the request. Check your Options in the drop-down menu of this sections header.

          Activity

            People

            Assignee:
            kkohne Kai Köhne
            Reporter:
            janihe Jani Heikkinen
            Votes:
            0 Vote for this issue
            Watchers:
            3 Start watching this issue

              Dates

              Created:
              Updated:
              Resolved:

                Gerrit Reviews

                There are no open Gerrit changes