Uploaded image for project: 'Qt'
  1. Qt
  2. QTBUG-88471

Qt 6.0.0 build failure

    XMLWordPrintable

    Details

    • Type: Bug
    • Status: Closed
    • Priority: P0: Blocker
    • Resolution: Done
    • Affects Version/s: 6.0.0 Beta5
    • Fix Version/s: 6.0.0 Beta5
    • Component/s: QML: Tooling
    • Labels:
      None
    • Commits:
      cc5669bd4555f9912bcc332239751af01d287507 (qt/qtdeclarative/dev)

      Description

      ...
      agent:2020/11/13 05:25:34 build.go:379: > /usr/bin/ld: main.o: in function `main':
      agent:2020/11/13 05:25:34 build.go:379: > main.cpp:(.text.startup+0x9): undefined reference to `dlopen'
      agent:2020/11/13 05:25:34 build.go:379: > /usr/bin/ld: main.cpp:(.text.startup+0x11): undefined reference to `dlclose'
      agent:2020/11/13 05:25:34 build.go:379: > /usr/bin/ld: main.cpp:(.text.startup+0x1a): undefined reference to `dlsym'
      agent:2020/11/13 05:25:34 build.go:379: > /usr/bin/ld: main.cpp:(.text.startup+0x1f): undefined reference to `dlerror'
      agent:2020/11/13 05:25:34 build.go:379: > collect2: error: ld returned 1 exit status
      agent:2020/11/13 05:25:34 build.go:379: > make: *** [Makefile:67: libdl] Error 1
      agent:2020/11/13 05:25:34 build.go:379:  => source failed verification
      ...
      agent:2020/11/13 05:25:35 build.go:379: + cd /home/qt/work/build/config.tests/intelcet && MAKEFLAGS= /usr/bin/make
      agent:2020/11/13 05:25:35 build.go:379: > g++ -c -pipe -O2 -std=gnu++1z -w -fPIC  -I. -I/home/qt/work/qt/qt5/qtbase/mkspecs/linux-g++ -o main.o main.cpp
      agent:2020/11/13 05:25:35 build.go:379: > main.cpp:7:8: error: #error Intel CET not available
      agent:2020/11/13 05:25:35 build.go:379: >     7 |     #  error Intel CET not available
      agent:2020/11/13 05:25:35 build.go:379: >       |        ^~~~~
      agent:2020/11/13 05:25:35 build.go:379: > make: *** [Makefile:167: main.o] Error 1
      agent:2020/11/13 05:25:35 build.go:379: test config.qtbase.tests.intelcet FAILED
      ...
      agent:2020/11/13 05:25:41 build.go:379: > main.cpp:2:10: fatal error: zstd.h: No such file or directory
      agent:2020/11/13 05:25:41 build.go:379: >     2 | #include <zstd.h>
      agent:2020/11/13 05:25:41 build.go:379: >       |          ^~~~~~~~
      agent:2020/11/13 05:25:41 build.go:379: > compilation terminated.
      agent:2020/11/13 05:25:41 build.go:379: > make: *** [Makefile:167: main.o] Error 1
      agent:2020/11/13 05:25:41 build.go:379:  => source failed verification.
      agent:2020/11/13 05:25:41 build.go:379: test config.qtbase.libraries.zstd FAILED
      ...
      

      Build log: https://testresults.qt.io/logs/qt/qt5/f794cc51d577f9651d4885c5768af75d647c2125/LinuxUbuntu_20_04x86_64LinuxUbuntu_20_04x86_64GCCqtci-linux-Ubuntu-20.04-x86_64-50-4a6b64Documentation_OutOfSourceBuild_UseLegacyInstructions/33a6e97e273a7953eb475d016ce976262b7d7d01/build_1605244847/log.txt.gz

      Details: https://testresults.qt.io/coin/integration/qt/qt5/tasks/1605244651

      Tested changes (refs/builds/qtci/dev/1605244649):
      https://codereview.qt-project.org/c/qt/qt5/+/321691/1 Update submodules on 'dev' in qt/qt5

        Attachments

        For Gerrit Dashboard: QTBUG-88471
        # Subject Branch Project Status CR V

          Activity

            People

            Assignee:
            ulherman Ulf Hermann
            Reporter:
            janihe Jani Heikkinen
            Votes:
            0 Vote for this issue
            Watchers:
            5 Start watching this issue

              Dates

              Created:
              Updated:
              Resolved:

                Gerrit Reviews

                There are no open Gerrit changes