Uploaded image for project: 'Qt'
  1. Qt
  2. QTBUG-91358

Unable to build QtScxml Add-On with Conan, Qt6.1.0 alpha&beta1, macOS-clang-10.14-x64_iOS

    XMLWordPrintable

    Details

    • Type: Bug
    • Status: Closed
    • Priority: P4: Low
    • Resolution: Out of scope
    • Affects Version/s: 6.1.0 Alpha, 6.1.0 Beta 1, 6.1.0 Beta2
    • Fix Version/s: 6.1.0 Beta3
    • Component/s: Build System, XML: SCXML
    • Labels:
    • Platform/s:
      macOS
    • Story Points:
      13
    • Sprint:
      Qt6_Foundation_Sprint 29

      Description

      Description
      Install Qt6.1.0-alpha, Cmake, Ninja and Conan with online installer.
       
      Run build command:

      conan install qtscxml/6.1.0@qt/alpha --build=missing --profile=/Users/qt/RTA/qt5/Tools/Conan/profiles/qt-6.1.0-macx-ios -s build_type=Release -g cmake_paths -g cmake -g deploy

      Build fails:
      – Could NOT find Qt6ScxmlTools (missing: Qt6ScxmlTools_DIR)
      CMake Error at /Users/qt/RTA/qt5/6.1.0/ios/lib/cmake/Qt6/QtToolHelpers.cmake:100 (message):
      The tool "Qt6::qscxmlc" was not found in the Qt6ScxmlTools package.
      Package found: 0
      Call Stack (most recent call first):
      tools/qscxmlc/CMakeLists.txt:8 (qt_internal_add_tool)
       
       
      – Configuring incomplete, errors occurred!
      See also "/Users/qt/.conan/data/qtscxml/6.1.0/qt/alpha/build/7cf2e5e255d05ec298d62e8b5b4470bafe5f9c0f/CMakeFiles/CMakeOutput.log".
      See also "/Users/qt/.conan/data/qtscxml/6.1.0/qt/alpha/build/7cf2e5e255d05ec298d62e8b5b4470bafe5f9c0f/CMakeFiles/CMakeError.log".
      CMAKE_PREFIX_PATH for 'qtscxml/6.1.0' build is: /Users/qt/RTA/qt5/6.1.0/ios
      CMAKE_PREFIX_PATH for 'qtscxml/6.1.0' build is: /Users/qt/RTA/qt5/6.1.0/ios
      qtscxml/6.1.0@qt/alpha:
      qtscxml/6.1.0@qt/alpha: ERROR: Package '7cf2e5e255d05ec298d62e8b5b4470bafe5f9c0f'  
      qtscxml/6.1.0@qt/alpha: WARN: Build folder /Users/qt/.conan/data/qtscxml/6.1.0/qt/alpha/build/7cf2e5e255d05ec298d62e8b5b4470bafe5f9c0f
       
      ERROR: qtscxml/6.1.0@qt/alpha: Error in build() method, line 119
      self.run('%s "%s" %s' % (self._get_qtcmake(), self.source_folder, cmake.command_line))
      ConanException: Error 1 while executing /Users/qt/RTA/qt5/6.1.0/ios/bin/qt-cmake "/Users/qt/.conan/data/qtscxml/6.1.0/qt/alpha/build/7cf2e5e255d05ec298d62e8b5b4470bafe5f9c0f" -G "Ninja" -DCMAKE_BUILD_TYPE="Release" -DCMAKE_SYSTEM_NAME="iOS" -DCMAKE_SYSTEM_VERSION="13.2" -DCMAKE_OSX_DEPLOYMENT_TARGET="13.2" -DCONAN_IN_LOCAL_CACHE="ON" -DCONAN_COMPILER="apple-clang" -DCONAN_COMPILER_VERSION="11.0" -DCONAN_LIBCXX="libc++" -DCMAKE_INSTALL_PREFIX="/Users/qt/.conan/data/qtscxml/6.1.0/qt/alpha/build/7cf2e5e255d05ec298d62e8b5b4470bafe5f9c0f/_install_tmp" -DCMAKE_INSTALL_BINDIR="bin" -DCMAKE_INSTALL_SBINDIR="bin" -DCMAKE_INSTALL_LIBEXECDIR="bin" -DCMAKE_INSTALL_LIBDIR="lib" -DCMAKE_INSTALL_INCLUDEDIR="include" -DCMAKE_INSTALL_OLDINCLUDEDIR="include" -DCMAKE_INSTALL_DATAROOTDIR="share" -DCMAKE_EXPORT_NO_PACKAGE_REGISTRY="ON" -DCONAN_EXPORTED="1" -DCMAKE_VERBOSE_MAKEFILE="ON" -Wno-dev
       
      ['-- Could NOT find Qt6ScxmlTools (missing: Qt6ScxmlTools_DIR)', 'CMake Error at /Users/qt/RTA/qt5/6.1.0/ios/lib/cmake/Qt6/QtToolHelpers.cmake:100 (message):', ' The tool "Qt6::qscxmlc" was not found in the Qt6ScxmlTools package.', ' Package found: 0', 'Call Stack (most recent call first):', ' tools/qscxmlc/CMakeLists.txt:8 (qt_internal_add_tool)', '', '', '-- Configuring incomplete, errors occurred!', 'See also "/Users/qt/.conan/data/qtscxml/6.1.0/qt/alpha/build/7cf2e5e255d05ec298d62e8b5b4470bafe5f9c0f/CMakeFiles/CMakeOutput.log".', 'See also "/Users/qt/.conan/data/qtscxml/6.1.0/qt/alpha/build/7cf2e5e255d05ec298d62e8b5b4470bafe5f9c0f/CMakeFiles/CMakeError.log".', "CMAKE_PREFIX_PATH for 'qtscxml/6.1.0' build is: /Users/qt/RTA/qt5/6.1.0/ios", "CMAKE_PREFIX_PATH for 'qtscxml/6.1.0' build is: /Users/qt/RTA/qt5/6.1.0/ios", 'qtscxml/6.1.0@qt/alpha: ', "qtscxml/6.1.0@qt/alpha: ERROR: Package '7cf2e5e255d05ec298d62e8b5b4470bafe5f9c0f' build failed", 'qtscxml/6.1.0@qt/alpha: WARN: Build folder /Users/qt/.conan/data/qtscxml/6.1.0/qt/alpha/build/7cf2e5e255d05ec298d62e8b5b4470bafe5f9c0f', 'ERROR: qtscxml/6.1.0@qt/alpha: Error in build() method, line 119', '\tself.run(\'%s "%s" %s\' % (self._get_qtcmake(), self.source_folder, cmake.command_line))', '\tConanException: Error 1 while executing /Users/qt/RTA/qt5/6.1.0/ios/bin/qt-cmake "/Users/qt/.conan/data/qtscxml/6.1.0/qt/alpha/build/7cf2e5e255d05ec298d62e8b5b4470bafe5f9c0f" -G "Ninja" -DCMAKE_BUILD_TYPE="Release" -DCMAKE_SYSTEM_NAME="iOS" -DCMAKE_SYSTEM_VERSION="13.2" -DCMAKE_OSX_DEPLOYMENT_TARGET="13.2" -DCONAN_IN_LOCAL_CACHE="ON" -DCONAN_COMPILER="apple-clang" -DCONAN_COMPILER_VERSION="11.0" -DCONAN_LIBCXX="libc++" -DCMAKE_INSTALL_PREFIX="/Users/qt/.conan/data/qtscxml/6.1.0/qt/alpha/build/7cf2e5e255d05ec298d62e8b5b4470bafe5f9c0f/_install_tmp" -DCMAKE_INSTALL_BINDIR="bin" -DCMAKE_INSTALL_SBINDIR="bin" -DCMAKE_INSTALL_LIBEXECDIR="bin" -DCMAKE_INSTALL_LIBDIR="lib" -DCMAKE_INSTALL_INCLUDEDIR="include" -DCMAKE_INSTALL_OLDINCLUDEDIR="include" -DCMAKE_INSTALL_DATAROOTDIR="share" -DCMAKE_EXPORT_NO_PACKAGE_REGISTRY="ON" -DCONAN_EXPORTED="1" -DCMAKE_VERBOSE_MAKEFILE="ON" -Wno-dev', '']
      – Could NOT find Qt6ScxmlTools (missing: Qt6ScxmlTools_DIR)
      CMake Error at /Users/qt/RTA/qt5/6.1.0/ios/lib/cmake/Qt6/QtToolHelpers.cmake:100 (message):
      CMake Error at /Users/qt/RTA/qt5/6.1.0/ios/lib/cmake/Qt6/QtToolHelpers.cmake:100 (message):
       LOG14:15:55
      The tool "Qt6::qscxmlc" was not found in the Qt6ScxmlTools package.
       
      Package found: 0
       
      Call Stack (most recent call first):
       
      tools/qscxmlc/CMakeLists.txt:8 (qt_internal_add_tool)
       
       
       
       
      – Configuring incomplete, errors occurred!
      – Configuring incomplete, errors occurred!
      See also "/Users/qt/.conan/data/qtscxml/6.1.0/qt/alpha/build/7cf2e5e255d05ec298d62e8b5b4470bafe5f9c0f/CMakeFiles/CMakeOutput.log".
       
       
      See also "/Users/qt/.conan/data/qtscxml/6.1.0/qt/alpha/build/7cf2e5e255d05ec298d62e8b5b4470bafe5f9c0f/CMakeFiles/CMakeError.log".
       
      See also "/Users/qt/.conan/data/qtscxml/6.1.0/qt/alpha/build/7cf2e5e255d05ec298d62e8b5b4470bafe5f9c0f/CMakeFiles/CMakeError.log".
       LOG14:15:55
      CMAKE_PREFIX_PATH for 'qtscxml/6.1.0' build is: /Users/qt/RTA/qt5/6.1.0/ios
       
       
      CMAKE_PREFIX_PATH for 'qtscxml/6.1.0' build is: /Users/qt/RTA/qt5/6.1.0/ios
       
      qtscxml/6.1.0@qt/alpha:
       
       
      qtscxml/6.1.0@qt/alpha: ERROR: Package '7cf2e5e255d05ec298d62e8b5b4470bafe5f9c0f' qtscxml/6.1.0@qt/alpha: WARN: Build folder /Users/qt/.conan/data/qtscxml/6.1.0/qt/alpha/build/7cf2e5e255d05ec298d62e8b5b4470bafe5f9c0f
       
       
       
      ERROR: qtscxml/6.1.0@qt/alpha: Error in build() method, line 119
      self.run('%s "%s" %s' % (self._get_qtcmake(), self.source_folder, cmake.command_line))
       
      ConanException: Error 1 while executing /Users/qt/RTA/qt5/6.1.0/ios/bin/qt-cmake "/Users/qt/.conan/data/qtscxml/6.1.0/qt/alpha/build/7cf2e5e255d05ec298d62e8b5b4470bafe5f9c0f" -G "Ninja" -DCMAKE_BUILD_TYPE="Release" -DCMAKE_SYSTEM_NAME="iOS" -DCMAKE_SYSTEM_VERSION="13.2" -DCMAKE_OSX_DEPLOYMENT_TARGET="13.2" -DCONAN_IN_LOCAL_CACHE="ON" -DCONAN_COMPILER="apple-clang" -DCONAN_COMPILER_VERSION="11.0" -DCONAN_LIBCXX="libc++" -DCMAKE_INSTALL_PREFIX="/Users/qt/.conan/data/qtscxml/6.1.0/qt/alpha/build/7cf2e5e255d05ec298d62e8b5b4470bafe5f9c0f/_install_tmp" -DCMAKE_INSTALL_BINDIR="bin" -DCMAKE_INSTALL_SBINDIR="bin" -DCMAKE_INSTALL_LIBEXECDIR="bin" -DCMAKE_INSTALL_LIBDIR="lib" -DCMAKE_INSTALL_INCLUDEDIR="include" -DCMAKE_INSTALL_OLDINCLUDEDIR="include" -DCMAKE_INSTALL_DATAROOTDIR="share" -DCMAKE_EXPORT_NO_PACKAGE_REGISTRY="ON" -DCONAN_EXPORTED="1" -DCMAKE_VERBOSE_MAKEFILE="ON" -Wno-dev
       
      ConanException: Error 1 while executing /Users/qt/RTA/qt5/6.1.0/ios/bin/qt-cmake "/Users/qt/.conan/data/qtscxml/6.1.0/qt/alpha/build/7cf2e5e255d05ec298d62e8b5b4470bafe5f9c0f" -G "Ninja" -DCMAKE_BUILD_TYPE="Release" -DCMAKE_SYSTEM_NAME="iOS" -DCMAKE_SYSTEM_VERSION="13.2" -DCMAKE_OSX_DEPLOYMENT_TARGET="13.2" -DCONAN_IN_LOCAL_CACHE="ON" -DCONAN_COMPILER="apple-clang" -DCONAN_COMPILER_VERSION="11.0" -DCONAN_LIBCXX="libc++" -DCMAKE_INSTALL_PREFIX="/Users/qt/.conan/data/qtscxml/6.1.0/qt/alpha/build/7cf2e5e255d05ec298d62e8b5b4470bafe5f9c0f/_install_tmp" -DCMAKE_INSTALL_BINDIR="bin" -DCMAKE_INSTALL_SBINDIR="bin" -DCMAKE_INSTALL_LIBEXECDIR="bin" -DCMAKE_INSTALL_LIBDIR="lib" -DCMAKE_INSTALL_INCLUDEDIR="include" -DCMAKE_INSTALL_OLDINCLUDEDIR="include" -DCMAKE_INSTALL_DATAROOTDIR="share" -DCMAKE_EXPORT_NO_PACKAGE_REGISTRY="ON" -DCONAN_EXPORTED="1" -DCMAKE_VERBOSE_MAKEFILE="ON" -Wno-dev
       

        Attachments

        No reviews matched the request. Check your Options in the drop-down menu of this sections header.

          Activity

            People

            Assignee:
            iknd Iikka Eklund
            Reporter:
            mierala Minna Erälä
            PM Owner:
            Maurice Kalinowski Maurice Kalinowski
            RnD Owner:
            Alex Blasche Alex Blasche
            Votes:
            0 Vote for this issue
            Watchers:
            8 Start watching this issue

              Dates

              Created:
              Updated:
              Resolved:

                Gerrit Reviews

                There are no open Gerrit changes