Uploaded image for project: 'Qt'
  1. Qt
  2. QTBUG-93779

[elxr] (error #412) unresolved symbols: 1

    XMLWordPrintable

    Details

    • Platform/s:
      Integrity
    • Commits:
      4341f6763b8a737ebc07bb78ead22bc05a1a515b (qt/qtbase/5.12.11) ab7ef94effe24ec3bc8aa15576836fc0faf55e52 (qt/qtbase/6.0) c35d18677420d8a2b31fcd976fb8084f44932129 (qt/qtbase/5.12) 1fe8ddc7fe2b39d9c5184f9fcca4da745dca36be (qt/qtbase/dev)

      Description

      I/home/qt/work/install/include/QtGui -I/home/qt/work/install/include/QtCore -I.moc -I/opt/ghs/int1144/INTEGRITY-include/Vivante/sdk/inc -I/home/qt/work/install/mkspecs/integrity-armv7-imx6 -o .obj/main.o main.cpp
      agent:2021/05/17 05:32:52 build.go:391: [elxr] (error #412) unresolved symbols: 1
      agent:2021/05/17 05:32:52 build.go:391:  __builtin_clz 	from libqjpeg.a(jcphuff.o)
      agent:2021/05/17 05:32:52 build.go:391: [elxr] (error) errors during processing
      agent:2021/05/17 05:32:52 build.go:391: make[2]: *** [../../bin/qmltestrunner] Error 1
      agent:2021/05/17 05:32:52 build.go:391: make[2]: Leaving directory `/home/qt/work/qt/qtdeclarative/tools/qmltestrunner'
      agent:2021/05/17 05:32:52 build.go:391: make[1]: *** [sub-qmltestrunner-make_first] Error 2
      agent:2021/05/17 05:32:52 build.go:391: make[1]: *** Waiting for unfinished jobs....
      agent:2021/05/17 05:32:57 build.go:391: cxintarm -bsp platform-cortex-a9 -os_dir /opt/ghs/int1144 -non_shared --signed_fields --no_commons --no_implicit_include --link_once_templates -non_shared --new_outside_of_constructor -Ospeed -Olink -Omax --c++11 --thread_local_storage --exceptions -o ../../bin/qml .obj/main.o .obj/qml_plugin_import.o .obj/qml_qml_plugin_import.o .obj/qrc_qml.o .obj/moc_conf.o   -L/opt/ghs/int1144/libs/Vivante /home/qt/work/qt/qtdeclarative/plugins/qmltooling/libqmldbg_debugger.a /home/qt/work/qt/qtdeclarative/plugins/qmltooling/libqmldbg_inspector.a /home/qt/work/qt/qtdeclarative/plugins/qmltooling/libqmldbg_local.a /home/qt/work/qt/qtdeclarative/plugins/qmltooling/libqmldbg_messages.a /home/qt/work/qt/qtdeclarative/plugins/qmltooling/libqmldbg_native.a /home/qt/work/qt/qtdeclarative/plugins/qmltooling/libqmldbg_nativedebugger.a /home/qt/work/qt/qtdeclarative/plugins/qmltooling/libqmldbg_preview.a /home/qt/work/qt/qtdeclarative/plugins/qmltooling/libqmldbg_profiler.a /home/qt/work/qt/qtdeclarative/plugins/qmltooling/libqmldbg_quickprofiler.a /home/qt/work/qt/qtdeclarative/plugins/qmltooling/libqmldbg_server.a /home/qt/work/qt/qtdeclarative/lib/libQt5PacketProtocol.a /home/qt/work/qt/qtdeclarative/plugins/qmltooling/libqmldbg_tcp.a /home/qt/work/install/plugins/platforms/libqeglfs.a /home/qt/work/install/plugins/imageformats/libqgif.a /home/qt/work/install/plugins/imageformats/libqico.a /home/qt/work/install/plugins/imageformats/libqjpeg.a /home/qt/work/install/plugins/egldeviceintegrations/libqeglfs-emu-integration.a /home/qt/work/install/plugins/egldeviceintegrations/libqeglfs-viv-integration.a /home/qt/work/install/lib/libQt5EglFSDeviceIntegration.a /home/qt/work/install/lib/libQt5EventDispatcherSupport.a /home/qt/work/install/lib/libQt5ServiceSupport.a /home/qt/work/install/lib/libQt5ThemeSupport.a /home/qt/work/install/lib/libQt5FontDatabaseSupport.a /home/qt/work/install/lib/libqtfreetype.a /home/qt/work/install/lib/libQt5FbSupport.a /home/qt/work/install/lib/libQt5EglSupport.a /home/qt/work/install/lib/libQt5PlatformCompositorSupport.a /home/qt/work/install/lib/libQt5DeviceDiscoverySupport.a /home/qt/work/install/lib/libQt5DBus.a /home/qt/work/install/lib/libQt5Widgets.a /home/qt/work/qt/qtdeclarative/qml/QtQuick/Window.2/libwindowplugin.a /home/qt/work/qt/qtdeclarative/qml/QtQuick.2/libqtquick2plugin.a /home/qt/work/qt/qtdeclarative/lib/libQt5Quick.a /home/qt/work/qt/qtdeclarative/lib/libQt5Qml.a /home/qt/work/install/lib/libQt5Gui.a /home/qt/work/install/lib/libqtlibpng.a /home/qt/work/install/lib/libqtharfbuzz.a -lhiddev /home/qt/work/install/lib/libQt5Network.a /home/qt/work/install/lib/libQt5Core.a -lposix -lsocket -lnet -lshm_client /home/qt/work/install/lib/libqtpcre2.a /opt/ghs/int1144/libs/Vivante/libGLESv2.a /opt/ghs/int1144/libs/Vivante/libEGL.a /opt/ghs/int1144/libs/Vivante/libGAL.a /opt/ghs/int1144/libs/Vivante/libVSC.a /opt/ghs/int1144/libs/Vivante/libGLSLC.a /opt/ghs/int1144/libs/platform-cortex-a9/libfbdev.a /opt/ghs/int1144/libs/arm-cortexa9-mpe-smp-thumb2/libivfs.a -lGLESv2 -lEGL -lGAL -lVSC -lGLSLC -lfbdev -livfs   
      agent:2021/05/17 05:33:00 build.go:391: [elxr] (error #412) unresolved symbols: 1
      agent:2021/05/17 05:33:00 build.go:391:  __builtin_clz 	from libqjpeg.a(jcphuff.o)
      agent:2021/05/17 05:33:00 build.go:391: [elxr] (error) errors during processing
      agent:2021/05/17 05:33:00 build.go:391: make[2]: *** [../../bin/qml] Error 1
      agent:2021/05/17 05:33:00 build.go:391: make[2]: Leaving directory `/home/qt/work/qt/qtdeclarative/tools/qml'
      agent:2021/05/17 05:33:00 build.go:391: make[1]: *** [sub-qml-make_first] Error 2
      agent:2021/05/17 05:33:00 build.go:391: make[1]: Leaving directory `/home/qt/work/qt/qtdeclarative/tools'
      agent:2021/05/17 05:33:00 build.go:391: make: *** [sub-tools-make_first] Error 2
      agent:2021/05/17 05:33:00 build.go:442: Process finished with error: exit status 2
      agent:2021/05/17 05:33:00 build.go:674: Executing scheduled instruction 1 of 1 - Upload all core dumps if there are some
      agent:2021/05/17 05:33:00 build.go:583: Skip uploading core files because CORE_FILES_PATH is not set in the environment
      agent:2021/05/17 05:33:00 build.go:682: 
      agent:2021/05/17 05:33:00 agent.go:314: Build failed
      agent:2021/05/17 05:33:00 agent.go:227: ERROR building: exit status 2
      INFO:workitem.py:652(32307): Agent FINISHED FAIL: <could not determine failure location - check log: /mnt/coin-storage-01/ci-working-dir/storage/qt/qtdeclarative/a67fa1a6e7f60e1a31fbe8023a19d4ccc04e5936/LinuxRHEL_7_4x86_64INTEGRITYINTEGRITY_11_04armv7GCCqtci-linux-RHEL-7.4-x86_64-11d4b0DisableTests/48625c91da3a90937d8b103e46cf46b2790be891/build_1621226515/log.txt.gz>: qt/qtdeclarative/a67fa1a6e7f60e1a31fbe8023a19d4ccc04e5936/LinuxRHEL_7_4x86_64INTEGRITYINTEGRITY_11_04armv7GCCqtci-linux-RHEL-7.4-x86_64-11d4b0DisableTests/48625c91da3a90937d8b103e46cf46b2790be891/Build
      

      Build log:

      Details: https://testresults.qt.io/coin/integration/qt/qt5/tasks/1621224740

      Tested changes (refs/builds/qtci/5.12.11/1620968428):
      https://codereview.qt-project.org/c/qt/qt5/+/349318/1 Update submodules on '5.12.11' in qt/qt5

        Attachments

        For Gerrit Dashboard: QTBUG-93779
        # Subject Branch Project Status CR V

          Activity

            People

            Assignee:
            vgt Eirik Aavitsland
            Reporter:
            janihe Jani Heikkinen
            Votes:
            0 Vote for this issue
            Watchers:
            2 Start watching this issue

              Dates

              Created:
              Updated:
              Resolved: