Uploaded image for project: 'Qt'
  1. Qt
  2. QTBUG-99852

MacOS 12 fails with Qt3d: tst_vector4d_sse.cpp:78:14: error: no member named 'setY' in 'tst_Vector4D_SSE'

    XMLWordPrintable

    Details

    • Type: Bug
    • Status: Closed
    • Priority: P1: Critical
    • Resolution: Fixed
    • Affects Version/s: 5.15
    • Fix Version/s: 5.15
    • Component/s: Qt3D
    • Labels:
      None
    • Platform/s:
      macOS

      Description

      http://coin/coin/integration/qt/tqtc-qt5/tasks/1642742285

      http://coin/coin/api/results/qt/qt3d/4a5fcdb2d4338c137c63c3e1ac304ea06e532ff9/MacOSMacOS_12x86_64MacOSMacOS_12x86_64-arm64Clangqtci-macos-12-x86_64-102-6ded0cInsignificant/cd996615d646a3a688579f7e7147f6f3acd908f5/build_1642742301/log.txt.gz

      tst_vector4d_sse.cpp:78:14: error: no member named 'setY' in 'tst_Vector4D_SSE'
              vec4.setY(454.0f);
              ~~~~ ^
      fatal error: too many errors emitted, stopping now [-ferror-limit=]
      20 errors generated.
      make[3]: *** [.obj/tst_vector4d_sse.o] Error 1
      
      8937:                  ~~~~ ^
      /Users/qt/work/install/lib/QtTest.framework/Headers/qtestcase.h:88:26: note: expanded from macro 'QCOMPARE'
          if (!QTest::qCompare(actual, expected, #actual, #expected, __FILE__, __LINE__))\
                               ^~~~~~
      tst_vector4d_sse.cpp:78:14: error: no member named 'setY' in 'tst_Vector4D_SSE'
              vec4.setY(454.0f);
              ~~~~ ^
      fatal error: too many errors emitted, stopping now [-ferror-limit=]
      20 errors generated.
      make[3]: *** [.obj/tst_vector4d_sse.o] Error 1
      make[2]: *** [sub-vector4d_sse-make_first] Error 2
      
      8938: /Users/qt/work/install/lib/QtTest.framework/Headers/qtestcase.h:88:26: note: expanded from macro 'QCOMPARE'
          if (!QTest::qCompare(actual, expected, #actual, #expected, __FILE__, __LINE__))\
                               ^~~~~~
      tst_vector4d_sse.cpp:78:14: error: no member named 'setY' in 'tst_Vector4D_SSE'
              vec4.setY(454.0f);
              ~~~~ ^
      fatal error: too many errors emitted, stopping now [-ferror-limit=]
      20 errors generated.
      make[3]: *** [.obj/tst_vector4d_sse.o] Error 1
      make[2]: *** [sub-vector4d_sse-make_first] Error 2
      make[1]: *** [sub-core-make_first] Error 2

        Attachments

          Issue Links

          No reviews matched the request. Check your Options in the drop-down menu of this sections header.

            Activity

              People

              Assignee:
              mkrus Mike Krus
              Reporter:
              hehalmet Heikki Halmet
              Votes:
              0 Vote for this issue
              Watchers:
              5 Start watching this issue

                Dates

                Created:
                Updated:
                Resolved:

                  Gerrit Reviews

                  There are no open Gerrit changes