Uploaded image for project: 'Qt'
  1. Qt
  2. QTBUG-103727

Build issue with qt-6.3.0 from git on Slackware 15.0

    XMLWordPrintable

    Details

    • Type: Bug
    • Status: Reported
    • Priority: P3: Somewhat important
    • Resolution: Unresolved
    • Affects Version/s: 6.3.0
    • Fix Version/s: None
    • Labels:
      None
    • Environment:
      Slackware 15.0
    • Platform/s:
      Linux/X11

      Description

      [ 64%] Linking CXX executable ../../../../qtbase/bin/lupdate
      /usr/bin/ld: CMakeFiles/lupdate.dir/cpp_clang.cpp.o: undefined reference to symbol '_ZTIN5clang7tooling21FrontendActionFactoryE'
      /usr/bin/ld: /usr/lib64/libclangTooling.so.13: error adding symbols: DSO missing from command line
      collect2: error: ld returned 1 exit status
      gmake[2]: *** [qttools/src/linguist/lupdate/CMakeFiles/lupdate.dir/build.make:465: qtbase/bin/lupdate] Error 1
      gmake[1]: *** [CMakeFiles/Makefile2:52917: qttools/src/linguist/lupdate/CMakeFiles/lupdate.dir/all] Error 2
      gmake: *** [Makefile:146: all] Error 2

        Attachments

        1. error.txt
          0.6 kB
        2. link.txt
          1 kB

          Issue Links

          No reviews matched the request. Check your Options in the drop-down menu of this sections header.

            Activity

              People

              Assignee:
              qtbuildsystem Qt Build System Team
              Reporter:
              nmourey Nathan Mourey
              Votes:
              0 Vote for this issue
              Watchers:
              3 Start watching this issue

                Dates

                Created:
                Updated:

                  Gerrit Reviews

                  There are no open Gerrit changes